Sonarqube has problem generating PDF report and pipeline fails

Must-share information (formatted with Markdown):
Jenkins plugin - SonarQube ScannerVersion2.17.1
java.version = 17.0.9
Sonarqube is deployed on ubuntu vm.

[ERROR] Error drawing duplicated rating circle: Cannot invoke "String.regionMatches(int, String, int, int)" because "text" is null

[2024-02-16T10:16:55.586Z] Exception in thread "main" java.lang.IllegalArgumentException: Y-Axis data cannot be empty!!! >ncloc

[2024-02-16T10:16:55.586Z] 	at org.knowm.xchart.XYChart.sanityCheck(XYChart.java:387)

[2024-02-16T10:16:55.586Z] 	at org.knowm.xchart.XYChart.addSeries(XYChart.java:287)

[2024-02-16T10:16:55.586Z] 	at org.knowm.xchart.XYChart.addSeries(XYChart.java:239)

[2024-02-16T10:16:55.586Z] 	at org.knowm.xchart.XYChart.addSeries(XYChart.java:198)

[2024-02-16T10:16:55.586Z] 	at com.bitegarden.sonar.plugins.report.util.ChartUtils.createAreaChart(Unknown Source)

[2024-02-16T10:16:55.586Z] 	at com.bitegarden.sonar.plugins.report.pdf.ReportEngine.generateActivityChartForDuplications(Unknown Source)

[2024-02-16T10:16:55.586Z] 	at com.bitegarden.sonar.plugins.report.pdf.ReportEngine.generateActivitySection(Unknown Source)

[2024-02-16T10:16:55.586Z] 	at com.bitegarden.sonar.plugins.report.pdf.ReportEngine.generateActivityPage(Unknown Source)

[2024-02-16T10:16:55.586Z] 	at com.bitegarden.sonar.plugins.report.pdf.ReportEngine.generateExecutiveReport(Unknown Source)

[2024-02-16T10:16:55.586Z] 	at com.bitegarden.sonar.plugins.report.CommandLine.generatePdf(Unknown Source)

[2024-02-16T10:16:55.586Z] 	at com.bitegarden.sonar.plugins.report.CommandLine.main(Unknown Source)

script returned exit code 1

It is not working on two projects, other projects pipeline pass with no problem.

BEFORE THIS, THIS ERROR existed

[ERROR] Error generating Excel: Component 'smth_game-directory-manager' on branch 'develop' not found

[2024-02-15T12:42:56.091Z] es.sonarqube.exceptions.SonarQubeException: Component 'singulargroup_game-directory-manager' on branch 'develop' not found

[2024-02-15T12:42:56.091Z] 	at es.sonarqube.exceptions.ExceptionUtils.getSonarQubeException(Unknown Source)

[2024-02-15T12:42:56.091Z] 	at com.bitegarden.sonar.plugins.report.util.ReportUtils.getBasicProjectInformation(Unknown Source)

[2024-02-15T12:42:56.091Z] 	at com.bitegarden.sonar.plugins.report.pdf.ReportEngine.<init>(Unknown Source)

[2024-02-15T12:42:56.091Z] 	at com.bitegarden.sonar.plugins.report.CommandLine.generatePdf(Unknown Source)

[2024-02-15T12:42:56.091Z] 	at com.bitegarden.sonar.plugins.report.CommandLine.main(Unknown Source)

[2024-02-15T12:42:56.091Z] Caused by: org.sonarqube.ws.client.HttpException: Error 404 on https://sonarcloud.io/api/components/show?branch=develop&component=smth_game-directory-manager : {"errors":[{"msg":"Component \u0027smth_game-directory-manager\u0027 on branch \u0027develop\u0027 not found"}]}

[2024-02-15T12:42:56.091Z] 	at org.sonarqube.ws.client.BaseResponse.failIfNotSuccessful(BaseResponse.java:36)

[2024-02-15T12:42:56.091Z] 	at org.sonarqube.ws.client.BaseService.call(BaseService.java:55)

[2024-02-15T12:42:56.091Z] 	at org.sonarqube.ws.client.BaseService.call(BaseService.java:50)

[2024-02-15T12:42:56.091Z] 	at org.sonarqube.ws.client.BaseService.call(BaseService.java:45)

[2024-02-15T12:42:56.091Z] 	at org.sonarqube.ws.client.components.ComponentsService.show(ComponentsService.java:108)

After building master, first error occured

Hey there.

You’ll probably want to reach out the vendor of this plugin: https://www.bitegarden.com/