SonarQube CE v10.5.1 giving analyze error

I am using SonarQube CE 10.5.1 to analyze the dotnet code from Azure DevOps pipeline. But, I get the below error.

INFO: Analysis report generated in 300ms, dir size=4.9 MB
INFO: Analysis report compressed in 742ms, zip size=1.7 MB
INFO: ------------------------------------------------------------------------
INFO: EXECUTION FAILURE
INFO: ------------------------------------------------------------------------
INFO: Total time: 1:04.354s
INFO: Final Memory: 16M/57M
INFO: ------------------------------------------------------------------------
##[error]ERROR: Error during SonarScanner execution
ERROR: Error during SonarScanner execution
##[error]java.lang.IllegalStateException: Failed to upload report: Error 500 on https://sonarqube.test.com/api/ce/submit?projectKey=Discovery-Scheduler-API&projectName=test%20Scheduler%20API : {"errors":[{"msg":"Fail to insert data of CE task 5f32636a-fe3b-43c4-864d-e9c9805da67f"}]}
java.lang.IllegalStateException: Failed to upload report: Error 500 on https://sonarqube.test.com/api/ce/submit?projectKey=test-Scheduler-API&projectName=test%20Scheduler%20API : {"errors":[{"msg":"Fail to insert data of CE task 5f32636a-fe3b-43c4-864d-e9c9805da67f"}]}
##[error]at org.sonar.scanner.report.ReportPublisher.upload(ReportPublisher.java:239)
	at org.sonar.scanner.report.ReportPublisher.upload(ReportPublisher.java:239)

Hey there.

Have you checked the resources of your database server backing the SonarQube instance? Namely disk space?

Hey Colin, it worked after I increased the DB space. Thanks for the help.

Glad my wild guess worked. :smiley: