Getting error while implementing sonarQube plugin in Intershop Studio based on eclipse using SonarQube and plugin

Must-share information (formatted with Markdown):

  • which versions are you using (SonarQube, Scanner, Plugin, and any relevant extension)
  • what are you trying to achieve
  • what have you tried so far to achieve this

Sonar Qube Version: 9.2.4
plugin GitHub - IntershopCommunicationsAG/sonarqube-gradle-plugin: This Gradle plugin analyzes Intershop components with SonarQube™
I am trying to run sonarQube analysis on my project cartridges . Please help me out as i am getting error .

[sts] -----------------------------------------------------
[sts] Starting Gradle build for the following tasks: 
[sts]      sonarqube
[sts] -----------------------------------------------------
Defaults for test.corporatename are used for inject repositories!
The local artifacts are stored in C:\Users\kagupta\.gradle\.localRepo!
Parallel execution is an incubating feature.
This project is not included in a SCM!
Project "microservices" is not handled by this version recommender plugin.
Project "microservices" is not handled by this version recommender plugin.
Project "microservices" is not handled by this version recommender plugin.
Project "microservices" is not handled by this version recommender plugin.
Project "microservices" is not handled by this version recommender plugin.
Project "microservices" is not handled by this version recommender plugin.
:app_sf_responsive:compileJava
:app_sf_responsive_b2b:resourceListOrm
:app_sf_responsive_b2b_test:processResources
:app_sf_responsive_b2c:sonarqube
:app_sf_responsive_cm:sonarqube
:app_sf_responsive_b2b_test:processResources UP-TO-DATE
:app_sf_responsive_b2b_test:processTestResources UP-TO-DATE
:app_sf_responsive_costcenter:sonarqube
:app_sf_responsive_b2b:resourceListOrm UP-TO-DATE
:app_sf_responsive_b2b:resourceListPipelets UP-TO-DATE
:app_sf_responsive_b2b:processResources UP-TO-DATE
:app_sf_responsive_b2b:processTestResources UP-TO-DATE
:bc_democrm:compileJava UP-TO-DATE
:bc_democrm:resourceListOrm UP-TO-DATE
:bc_democrm:resourceListPipelets UP-TO-DATE
:bc_democrm:processResources UP-TO-DATE
:bc_democrm:classes UP-TO-DATE
:bc_democrm:jar UP-TO-DATE
:app_sf_responsive_crm:resourceListOrm UP-TO-DATE
:app_sf_responsive_crm:resourceListPipelets UP-TO-DATE
:app_sf_responsive_crm:processResources UP-TO-DATE
:app_sf_responsive_crm:processTestResources UP-TO-DATE
:bc_myrating:compileJava
:app_sf_responsive:compileJava UP-TO-DATE
:app_sf_responsive:resourceListOrm
:bc_myrating:compileJava UP-TO-DATE
:app_sf_responsive:resourceListOrm UP-TO-DATE
:bc_myrating:resourceListOrm
:app_sf_responsive:resourceListPipelets
:bc_myrating:resourceListOrm UP-TO-DATE
:bc_myrating:resourceListPipelets
:app_sf_responsive:resourceListPipelets UP-TO-DATE
:app_sf_responsive:processResources
:bc_myrating:resourceListPipelets UP-TO-DATE
:bc_myrating:processResources
:app_sf_responsive:processResources UP-TO-DATE
:app_sf_responsive:classes UP-TO-DATE
:bc_myrating:processResources UP-TO-DATE
:app_sf_responsive:compileTestJava
:bc_myrating:classes UP-TO-DATE
:bc_myrating:jar UP-TO-DATE
:app_sf_responsive_demo:resourceListOrm UP-TO-DATE
:app_sf_responsive_demo:resourceListPipelets UP-TO-DATE
:app_sf_responsive_demo:processResources
INFO: Scanner configuration file: NONE
INFO: Scanner configuration file: NONE
:app_sf_responsive_demo:processResources UP-TO-DATE
:app_sf_responsive_demo:processTestResources UP-TO-DATE
:bc_mycar:compileJava
INFO: Project root configuration file: D:\intershop-cisetup-sources\projects\corporateshop\app_sf_responsive_costcenter\target\tmp\sonarqube\sonar-project.properties
INFO: Project root configuration file: D:\intershop-cisetup-sources\projects\corporateshop\app_sf_responsive_b2c\target\tmp\sonarqube\sonar-project.properties
INFO: Scanner configuration file: NONE
INFO: Project root configuration file: D:\intershop-cisetup-sources\projects\corporateshop\app_sf_responsive_cm\target\tmp\sonarqube\sonar-project.properties
INFO: SonarQube Scanner 2.7
INFO: Java 1.8.0_151 Oracle Corporation (64-bit)
INFO: Windows 10 10.0 amd64
INFO: SonarQube Scanner 2.7
INFO: Java 1.8.0_151 Oracle Corporation (64-bit)
INFO: Windows 10 10.0 amd64
INFO: SonarQube Scanner 2.7:bc_mycar:compileJava UP-TO-DATE

INFO: Java 1.8.0_151 Oracle Corporation (64-bit)
INFO: Windows 10 10.0 amd64
:bc_mycar:resourceListOrm UP-TO-DATE
:bc_mycar:resourceListPipelets UP-TO-DATE
:bc_mycar:processResources UP-TO-DATE
:bc_mycar:classes UP-TO-DATE
:bc_mycar:jar
:app_sf_responsive:compileTestJava UP-TO-DATE
:app_sf_responsive:processTestResources UP-TO-DATE
:app_sf_responsive:testClasses UP-TO-DATE
:app_sf_responsive:test
:bc_mycar:jar UP-TO-DATE
:app_sf_responsive_mycar:resourceListOrm UP-TO-DATE
:app_sf_responsive_mycar:resourceListPipelets UP-TO-DATE
:app_sf_responsive_mycar:processResources UP-TO-DATE
:app_sf_responsive_mycar:processTestResources UP-TO-DATE
:app_sf_responsive_smb:sonarqube
:app_sf_responsive:test UP-TO-DATE
:app_sf_responsive:sonarqube
INFO: Scanner configuration file: NONE
INFO: Project root configuration file: D:\intershop-cisetup-sources\projects\corporateshop\app_sf_responsive_smb\target\tmp\sonarqube\sonar-project.properties
INFO: SonarQube Scanner 2.7
INFO: Java 1.8.0_151 Oracle Corporation (64-bit)
INFO: Windows 10 10.0 amd64
INFO: User cache: C:\Users\kagupta\.sonar\cache
INFO: User cache: C:\Users\kagupta\.sonar\cache
INFO: User cache: C:\Users\kagupta\.sonar\cache
INFO: ------------------------------------------------------------------------
INFO: EXECUTION FAILURE
INFO: ------------------------------------------------------------------------
INFO: Total time: 2.385s
INFO: ------------------------------------------------------------------------
INFO: EXECUTION FAILURE
INFO: ------------------------------------------------------------------------
INFO: Total time: 2.429s
INFO: Final Memory: 5M/243M
ERROR: Error during SonarQube Scanner executionINFO: ------------------------------------------------------------------------

ERROR: Unable to execute SonarQube
ERROR: Caused by: Fail to download libraries from server
ERROR: Caused by: 1
ERROR: 
INFO: ------------------------------------------------------------------------ERROR: To see the full stack trace of the errors, re-run SonarQube Scanner with the -e switch.

ERROR: Re-run SonarQube Scanner using the -X switch to enable full debug logging.INFO: EXECUTION FAILURE

INFO: ------------------------------------------------------------------------
INFO: Total time: 2.403s
:app_sf_responsive_b2c:sonarqube FAILED
INFO: Final Memory: 4M/243M
INFO: ------------------------------------------------------------------------
ERROR: Error during SonarQube Scanner execution
ERROR: Unable to execute SonarQube
ERROR: Caused by: Fail to download libraries from server
ERROR: Caused by: 1
ERROR: 
ERROR: To see the full stack trace of the errors, re-run SonarQube Scanner with the -e switch.
ERROR: Re-run SonarQube Scanner using the -X switch to enable full debug logging.
INFO: Final Memory: 5M/243M
INFO: ------------------------------------------------------------------------
ERROR: Error during SonarQube Scanner execution
ERROR: Unable to execute SonarQube
ERROR: Caused by: Fail to download libraries from server
ERROR: Caused by: 1
ERROR: 
ERROR: To see the full stack trace of the errors, re-run SonarQube Scanner with the -e switch.
ERROR: Re-run SonarQube Scanner using the -X switch to enable full debug logging.
:app_sf_responsive_cm:sonarqube FAILED
:app_sf_responsive_costcenter:sonarqube FAILED
INFO: Scanner configuration file: NONE
INFO: Project root configuration file: D:\intershop-cisetup-sources\projects\corporateshop\app_sf_responsive\target\tmp\sonarqube\sonar-project.properties
INFO: SonarQube Scanner 2.7
INFO: Java 1.8.0_151 Oracle Corporation (64-bit)
INFO: Windows 10 10.0 amd64
INFO: User cache: C:\Users\kagupta\.sonar\cache
INFO: ------------------------------------------------------------------------
INFO: EXECUTION FAILURE
INFO: ------------------------------------------------------------------------
INFO: Total time: 1.881s
INFO: Final Memory: 4M/243M
INFO: ------------------------------------------------------------------------
ERROR: Error during SonarQube Scanner execution
ERROR: Unable to execute SonarQube
ERROR: Caused by: Fail to download libraries from server
ERROR: Caused by: 1
ERROR: 
ERROR: To see the full stack trace of the errors, re-run SonarQube Scanner with the -e switch.
ERROR: Re-run SonarQube Scanner using the -X switch to enable full debug logging.
:app_sf_responsive_smb:sonarqube FAILED
INFO: User cache: C:\Users\kagupta\.sonar\cache
INFO: ------------------------------------------------------------------------
INFO: EXECUTION FAILURE
INFO: ------------------------------------------------------------------------
INFO: Total time: 1.397s
INFO: Final Memory: 4M/243MERROR: Error during SonarQube Scanner execution
INFO: ------------------------------------------------------------------------

ERROR: Unable to execute SonarQube
ERROR: Caused by: Fail to download libraries from server
ERROR: Caused by: 1
ERROR: 
ERROR: To see the full stack trace of the errors, re-run SonarQube Scanner with the -e switch.
ERROR: Re-run SonarQube Scanner using the -X switch to enable full debug logging.
:app_sf_responsive:sonarqube FAILED

FAILURE: Build completed with 5 failures.

1: Task failed with an exception.
-----------
* What went wrong:
Execution failed for task ':app_sf_responsive_b2c:sonarqube'.
> Process 'command 'C:\Program Files\Java\jdk1.8.0_151\bin\java.exe'' finished with non-zero exit value 1

* Try:
Run with --stacktrace option to get the stack trace. Run with --info or --debug option to get more log output.
==============================================================================

2: Task failed with an exception.
-----------
* What went wrong:
Execution failed for task ':app_sf_responsive_cm:sonarqube'.
> Process 'command 'C:\Program Files\Java\jdk1.8.0_151\bin\java.exe'' finished with non-zero exit value 1

* Try:
Run with --stacktrace option to get the stack trace. Run with --info or --debug option to get more log output.
==============================================================================

3: Task failed with an exception.
-----------
* What went wrong:
Execution failed for task ':app_sf_responsive_costcenter:sonarqube'.
> Process 'command 'C:\Program Files\Java\jdk1.8.0_151\bin\java.exe'' finished with non-zero exit value 1

* Try:
Run with --stacktrace option to get the stack trace. Run with --info or --debug option to get more log output.
==============================================================================

4: Task failed with an exception.
-----------
* What went wrong:
Execution failed for task ':app_sf_responsive_smb:sonarqube'.
> Process 'command 'C:\Program Files\Java\jdk1.8.0_151\bin\java.exe'' finished with non-zero exit value 1

* Try:
Run with --stacktrace option to get the stack trace. Run with --info or --debug option to get more log output.
==============================================================================

5: Task failed with an exception.
-----------
* What went wrong:
Execution failed for task ':app_sf_responsive:sonarqube'.
> Process 'command 'C:\Program Files\Java\jdk1.8.0_151\bin\java.exe'' finished with non-zero exit value 1

* Try:
Run with --stacktrace option to get the stack trace. Run with --info or --debug option to get more log output.
==============================================================================

BUILD FAILED

Total time: 11.528 secs
[sts] Build failed
org.gradle.tooling.BuildException: Could not execute build using Gradle distribution 'http://nexus:8081/nexus/content/repositories/distributions/gradle-dist/test.corporatename/2.0.0/test.corporatename-2.0.0.zip'.
	at org.gradle.tooling.internal.consumer.ExceptionTransformer.transform(ExceptionTransformer.java:51)
	at org.gradle.tooling.internal.consumer.ExceptionTransformer.transform(ExceptionTransformer.java:29)
	at org.gradle.tooling.internal.consumer.ResultHandlerAdapter.onFailure(ResultHandlerAdapter.java:41)
	at org.gradle.tooling.internal.consumer.async.DefaultAsyncConsumerActionExecutor$1$1.run(DefaultAsyncConsumerActionExecutor.java:57)
	at org.gradle.internal.concurrent.ExecutorPolicy$CatchAndRecordFailures.onExecute(ExecutorPolicy.java:63)
	at org.gradle.internal.concurrent.ManagedExecutorImpl$1.run(ManagedExecutorImpl.java:46)
	at java.util.concurrent.ThreadPoolExecutor.runWorker(ThreadPoolExecutor.java:1149)
	at java.util.concurrent.ThreadPoolExecutor$Worker.run(ThreadPoolExecutor.java:624)
	at org.gradle.internal.concurrent.ThreadFactoryImpl$ManagedThreadRunnable.run(ThreadFactoryImpl.java:55)
	at java.lang.Thread.run(Thread.java:748)
	at org.gradle.tooling.internal.consumer.BlockingResultHandler.getResult(BlockingResultHandler.java:46)
	at org.gradle.tooling.internal.consumer.DefaultBuildLauncher.run(DefaultBuildLauncher.java:77)
	at org.springsource.ide.eclipse.gradle.core.TaskUtil.execute(Unknown Source)
	at org.springsource.ide.eclipse.gradle.core.launch.GradleProcess$1.doit(Unknown Source)
	at org.springsource.ide.eclipse.gradle.core.util.GradleRunnable$1.run(Unknown Source)
	at org.eclipse.core.internal.jobs.Worker.run(Worker.java:63)
Caused by: org.gradle.execution.MultipleBuildFailures: Multiple build failures
	at org.gradle.execution.taskgraph.DefaultTaskExecutionPlan.rethrowFailures(DefaultTaskExecutionPlan.java:726)
	at org.gradle.execution.taskgraph.DefaultTaskExecutionPlan.awaitCompletion(DefaultTaskExecutionPlan.java:711)
	at org.gradle.execution.taskgraph.ParallelTaskPlanExecutor.process(ParallelTaskPlanExecutor.java:48)
	at org.gradle.execution.taskgraph.DefaultTaskGraphExecuter.execute(DefaultTaskGraphExecuter.java:110)
	at org.gradle.execution.SelectedTaskExecutionAction.execute(SelectedTaskExecutionAction.java:37)
	at org.gradle.execution.DefaultBuildExecuter.execute(DefaultBuildExecuter.java:37)
	at org.gradle.execution.DefaultBuildExecuter.access$000(DefaultBuildExecuter.java:23)
	at org.gradle.execution.DefaultBuildExecuter$1.proceed(DefaultBuildExecuter.java:43)
	at org.gradle.execution.DryRunBuildExecutionAction.execute(DryRunBuildExecutionAction.java:32)
	at org.gradle.execution.DefaultBuildExecuter.execute(DefaultBuildExecuter.java:37)
	at org.gradle.execution.DefaultBuildExecuter.execute(DefaultBuildExecuter.java:30)
	at org.gradle.initialization.DefaultGradleLauncher$4.run(DefaultGradleLauncher.java:154)
	at org.gradle.internal.Factories$1.create(Factories.java:22)
	at org.gradle.internal.progress.DefaultBuildOperationExecutor.run(DefaultBuildOperationExecutor.java:90)
	at org.gradle.internal.progress.DefaultBuildOperationExecutor.run(DefaultBuildOperationExecutor.java:52)
	at org.gradle.initialization.DefaultGradleLauncher.doBuildStages(DefaultGradleLauncher.java:151)
	at org.gradle.initialization.DefaultGradleLauncher.access$200(DefaultGradleLauncher.java:32)
	at org.gradle.initialization.DefaultGradleLauncher$1.create(DefaultGradleLauncher.java:99)
	at org.gradle.initialization.DefaultGradleLauncher$1.create(DefaultGradleLauncher.java:93)
	at org.gradle.internal.progress.DefaultBuildOperationExecutor.run(DefaultBuildOperationExecutor.java:90)
	at org.gradle.internal.progress.DefaultBuildOperationExecutor.run(DefaultBuildOperationExecutor.java:62)
	at org.gradle.initialization.DefaultGradleLauncher.doBuild(DefaultGradleLauncher.java:93)
	at org.gradle.initialization.DefaultGradleLauncher.run(DefaultGradleLauncher.java:82)
	at org.gradle.launcher.exec.InProcessBuildActionExecuter$DefaultBuildController.run(InProcessBuildActionExecuter.java:94)
	at org.gradle.tooling.internal.provider.runner.BuildModelActionRunner.run(BuildModelActionRunner.java:46)
	at org.gradle.launcher.exec.ChainingBuildActionRunner.run(ChainingBuildActionRunner.java:35)
	at org.gradle.tooling.internal.provider.runner.SubscribableBuildActionRunner.run(SubscribableBuildActionRunner.java:58)
	at org.gradle.launcher.exec.ChainingBuildActionRunner.run(ChainingBuildActionRunner.java:35)
	at org.gradle.launcher.exec.InProcessBuildActionExecuter.execute(InProcessBuildActionExecuter.java:43)
	at org.gradle.launcher.exec.InProcessBuildActionExecuter.execute(InProcessBuildActionExecuter.java:28)
	at org.gradle.launcher.exec.ContinuousBuildActionExecuter.execute(ContinuousBuildActionExecuter.java:75)
	at org.gradle.launcher.exec.ContinuousBuildActionExecuter.execute(ContinuousBuildActionExecuter.java:45)
	at org.gradle.launcher.daemon.server.exec.ExecuteBuild.doBuild(ExecuteBuild.java:52)
	at org.gradle.launcher.daemon.server.exec.BuildCommandOnly.execute(BuildCommandOnly.java:36)
	at org.gradle.launcher.daemon.server.api.DaemonCommandExecution.proceed(DaemonCommandExecution.java:120)
	at org.gradle.launcher.daemon.server.exec.WatchForDisconnection.execute(WatchForDisconnection.java:37)
	at org.gradle.launcher.daemon.server.api.DaemonCommandExecution.proceed(DaemonCommandExecution.java:120)
	at org.gradle.launcher.daemon.server.exec.ResetDeprecationLogger.execute(ResetDeprecationLogger.java:26)
	at org.gradle.launcher.daemon.server.api.DaemonCommandExecution.proceed(DaemonCommandExecution.java:120)
	at org.gradle.launcher.daemon.server.exec.RequestStopIfSingleUsedDaemon.execute(RequestStopIfSingleUsedDaemon.java:34)
	at org.gradle.launcher.daemon.server.api.DaemonCommandExecution.proceed(DaemonCommandExecution.java:120)
	at org.gradle.launcher.daemon.server.exec.ForwardClientInput$2.call(ForwardClientInput.java:74)
	at org.gradle.launcher.daemon.server.exec.ForwardClientInput$2.call(ForwardClientInput.java:72)
	at org.gradle.util.Swapper.swap(Swapper.java:38)
	at org.gradle.launcher.daemon.server.exec.ForwardClientInput.execute(ForwardClientInput.java:72)
	at org.gradle.launcher.daemon.server.api.DaemonCommandExecution.proceed(DaemonCommandExecution.java:120)
	at org.gradle.launcher.daemon.server.health.DaemonHealthTracker.execute(DaemonHealthTracker.java:47)
	at org.gradle.launcher.daemon.server.api.DaemonCommandExecution.proceed(DaemonCommandExecution.java:120)
	at org.gradle.launcher.daemon.server.exec.LogToClient.doBuild(LogToClient.java:66)
	at org.gradle.launcher.daemon.server.exec.BuildCommandOnly.execute(BuildCommandOnly.java:36)
	at org.gradle.launcher.daemon.server.api.DaemonCommandExecution.proceed(DaemonCommandExecution.java:120)
	at org.gradle.launcher.daemon.server.exec.EstablishBuildEnvironment.doBuild(EstablishBuildEnvironment.java:72)
	at org.gradle.launcher.daemon.server.exec.BuildCommandOnly.execute(BuildCommandOnly.java:36)
	at org.gradle.launcher.daemon.server.api.DaemonCommandExecution.proceed(DaemonCommandExecution.java:120)
	at org.gradle.launcher.daemon.server.health.HintGCAfterBuild.execute(HintGCAfterBuild.java:41)
	at org.gradle.launcher.daemon.server.api.DaemonCommandExecution.proceed(DaemonCommandExecution.java:120)
	at org.gradle.launcher.daemon.server.exec.StartBuildOrRespondWithBusy$1.run(StartBuildOrRespondWithBusy.java:50)
	at org.gradle.launcher.daemon.server.DaemonStateCoordinator$1.run(DaemonStateCoordinator.java:246)
	at org.gradle.internal.concurrent.ExecutorPolicy$CatchAndRecordFailures.onExecute(ExecutorPolicy.java:54)
	at org.gradle.internal.concurrent.StoppableExecutorImpl$1.run(StoppableExecutorImpl.java:40)
Caused by: org.gradle.internal.exceptions.LocationAwareException: Execution failed for task ':app_sf_responsive_b2c:sonarqube'.
	at org.gradle.initialization.DefaultExceptionAnalyser.transform(DefaultExceptionAnalyser.java:74)
	at org.gradle.initialization.MultipleBuildFailuresExceptionAnalyser.transform(MultipleBuildFailuresExceptionAnalyser.java:47)
	at org.gradle.initialization.MultipleBuildFailuresExceptionAnalyser.transform(MultipleBuildFailuresExceptionAnalyser.java:41)
	at org.gradle.initialization.StackTraceSanitizingExceptionAnalyser.transform(StackTraceSanitizingExceptionAnalyser.java:30)
	at org.gradle.initialization.DefaultGradleLauncher$1.create(DefaultGradleLauncher.java:101)
	... 42 more
Caused by: org.gradle.api.tasks.TaskExecutionException: Execution failed for task ':app_sf_responsive_b2c:sonarqube'.
	at org.gradle.api.internal.tasks.execution.ExecuteActionsTaskExecuter.executeActions(ExecuteActionsTaskExecuter.java:69)
	at org.gradle.api.internal.tasks.execution.ExecuteActionsTaskExecuter.execute(ExecuteActionsTaskExecuter.java:46)
	at org.gradle.api.internal.tasks.execution.PostExecutionAnalysisTaskExecuter.execute(PostExecutionAnalysisTaskExecuter.java:35)
	at org.gradle.api.internal.tasks.execution.SkipUpToDateTaskExecuter.execute(SkipUpToDateTaskExecuter.java:64)
	at org.gradle.api.internal.tasks.execution.ValidatingTaskExecuter.execute(ValidatingTaskExecuter.java:58)
	at org.gradle.api.internal.tasks.execution.SkipEmptySourceFilesTaskExecuter.execute(SkipEmptySourceFilesTaskExecuter.java:52)
	at org.gradle.api.internal.tasks.execution.SkipTaskWithNoActionsExecuter.execute(SkipTaskWithNoActionsExecuter.java:52)
	at org.gradle.api.internal.tasks.execution.SkipOnlyIfTaskExecuter.execute(SkipOnlyIfTaskExecuter.java:53)
	at org.gradle.api.internal.tasks.execution.ExecuteAtMostOnceTaskExecuter.execute(ExecuteAtMostOnceTaskExecuter.java:43)
	at org.gradle.execution.taskgraph.DefaultTaskGraphExecuter$EventFiringTaskWorker.execute(DefaultTaskGraphExecuter.java:203)
	at org.gradle.execution.taskgraph.DefaultTaskGraphExecuter$EventFiringTaskWorker.execute(DefaultTaskGraphExecuter.java:185)
	at org.gradle.execution.taskgraph.AbstractTaskPlanExecutor$TaskExecutorWorker.processTask(AbstractTaskPlanExecutor.java:66)
	at org.gradle.execution.taskgraph.AbstractTaskPlanExecutor$TaskExecutorWorker.run(AbstractTaskPlanExecutor.java:50)
	... 2 more
Caused by: org.gradle.process.internal.ExecException: Process 'command 'C:\Program Files\Java\jdk1.8.0_151\bin\java.exe'' finished with non-zero exit value 1
	at org.gradle.process.internal.DefaultExecHandle$ExecResultImpl.assertNormalExitValue(DefaultExecHandle.java:367)
	at org.gradle.process.ExecResult$assertNormalExitValue.call(Unknown Source)
	at com.intershop.gradle.sonarqube.tasks.SonarQubeRunner.run(SonarQubeRunner.groovy:59)
	at org.gradle.internal.reflect.JavaMethod.invoke(JavaMethod.java:75)
	at org.gradle.api.internal.project.taskfactory.AnnotationProcessingTaskFactory$StandardTaskAction.doExecute(AnnotationProcessingTaskFactory.java:227)
	at org.gradle.api.internal.project.taskfactory.AnnotationProcessingTaskFactory$StandardTaskAction.execute(AnnotationProcessingTaskFactory.java:220)
	at org.gradle.api.internal.project.taskfactory.AnnotationProcessingTaskFactory$StandardTaskAction.execute(AnnotationProcessingTaskFactory.java:209)
	at org.gradle.api.internal.AbstractTask$TaskActionWrapper.execute(AbstractTask.java:585)
	at org.gradle.api.internal.AbstractTask$TaskActionWrapper.execute(AbstractTask.java:568)
	at org.gradle.api.internal.tasks.execution.ExecuteActionsTaskExecuter.executeAction(ExecuteActionsTaskExecuter.java:80)
	at org.gradle.api.internal.tasks.execution.ExecuteActionsTaskExecuter.executeActions(ExecuteActionsTaskExecuter.java:61)
	... 14 more
[sts] Time taken: 0 min, 12 sec
[sts] -----------------------------------------------------

Hi,

Welcome to the community!

Thanks for sharing your analysis logs. What did you make of them?

I see several possibilities.

Off-hand it looks like either a misconfiguration of your SonarQube location

Or perhaps something on your network (e.g. proxy or firewall) interfering with the transfer of the library binaries (since, the library download isn’t the first call made to the server during analysis).

A third, less obvious option is also there in your log:

The current scanner version is 4.6.2. It appears that the specialized scanner you’re using is a bit long in the tooth; the last commit on that project was in 2019. I would try dropping it and doing a standard Gradle analysis.

 
HTH,
Ann