Execution failed for task ':sonarqube'. Fail to request https://url

Hello,
I am having this issue when I am running my build from the bamboo, bamboo agent that’s running in a docker.

This is the way of calling the sonarqube, and a properties file with the url and the token to do the connection.

sonarqube {
    properties {
        def currentBranch = getWorkingBranch()
        def projectNameWithBranch = "test - " + currentBranch
        property "sonar.projectName", projectNameWithBranch
    }
}
||FAILURE: Build failed with an exception.|
|---|---|
|10-Aug-2022 07:48:58||
|10-Aug-2022 07:48:58|* What went wrong:|
|10-Aug-2022 07:48:58|Execution failed for task ':sonarqube'.|
|10-Aug-2022 07:48:58|> Fail to request https://url

This is running a gradle build for Java code,
Gradle version 6.5, and java version “1.8.0_181”.

When I am running it locally on my machine with the same versions fro gradle and java this is running with success and it’s able to upload the result.
On the bamboo agent I also ran a curl https://url and I am able to get the output, I would say that the connection is working fine. Do you have any idea why I am getting this error?

What version of SonarQube are you using?

8.3.1.34397

Checking the logs from the SonarQube server, looks like when I am running locally it’s doing the POST request. Running it from Bamboo it’s not doing the POST, it is able to do all the GET request… The problem is that it is not returning any error on the server. Any idea what else to check?

Hi,

Your version is past EOL. You should upgrade to either the latest version or the current LTS at your earliest convenience. Your upgrade path is:

8.3.1 → 8.9.9 → 9.5 (last step optional)

You may find the Upgrade Guide and the LTS-to-LTS Upgrade Notes helpful. If you have questions about upgrading, feel free to open a new thread for that here.

If your error persists after upgrade, please come back to us.

Hi,
I have upgrade the version to 8.9.9.56886 and I am getting the same error.

Execution failed for task ':sonarqube'.
> Fail to request url: https://{url}

Do you get a more detailed error log if you add --debug or --stacktrace to the Gradle command?

Hi Colin, sorry for the late reply. Here are some extra logs with--stacktrace:

build	23-Sep-2022 07:46:24	> Task :sonarqube FAILED
error	23-Sep-2022 07:46:24	
error	23-Sep-2022 07:46:24	FAILURE: Build failed with an exception.
error	23-Sep-2022 07:46:24	
error	23-Sep-2022 07:46:24	* What went wrong:
error	23-Sep-2022 07:46:24	Execution failed for task ':sonarqube'.
error	23-Sep-2022 07:46:24	> Fail to request url: https://url/sonarqube/api/ce/submit?projectKey=kkp3&projectName=kkp3%20-%20sonarqube-test
error	23-Sep-2022 07:46:24	
error	23-Sep-2022 07:46:24	* Try:
error	23-Sep-2022 07:46:24	Run with --info or --debug option to get more log output. Run with --scan to get full insights.
error	23-Sep-2022 07:46:24	
error	23-Sep-2022 07:46:24	* Exception is:
error	23-Sep-2022 07:46:24	org.gradle.api.tasks.TaskExecutionException: Execution failed for task ':sonarqube'.
error	23-Sep-2022 07:46:24		at org.gradle.api.internal.tasks.execution.ExecuteActionsTaskExecuter.lambda$executeIfValid$1(ExecuteActionsTaskExecuter.java:207)
error	23-Sep-2022 07:46:24		at org.gradle.internal.Try$Failure.ifSuccessfulOrElse(Try.java:263)
error	23-Sep-2022 07:46:24		at org.gradle.api.internal.tasks.execution.ExecuteActionsTaskExecuter.executeIfValid(ExecuteActionsTaskExecuter.java:205)
error	23-Sep-2022 07:46:24		at org.gradle.api.internal.tasks.execution.ExecuteActionsTaskExecuter.execute(ExecuteActionsTaskExecuter.java:186)
error	23-Sep-2022 07:46:24		at org.gradle.api.internal.tasks.execution.CleanupStaleOutputsExecuter.execute(CleanupStaleOutputsExecuter.java:114)
error	23-Sep-2022 07:46:24		at org.gradle.api.internal.tasks.execution.FinalizePropertiesTaskExecuter.execute(FinalizePropertiesTaskExecuter.java:46)
error	23-Sep-2022 07:46:24		at org.gradle.api.internal.tasks.execution.ResolveTaskExecutionModeExecuter.execute(ResolveTaskExecutionModeExecuter.java:62)
error	23-Sep-2022 07:46:24		at org.gradle.api.internal.tasks.execution.SkipTaskWithNoActionsExecuter.execute(SkipTaskWithNoActionsExecuter.java:57)
error	23-Sep-2022 07:46:24		at org.gradle.api.internal.tasks.execution.SkipOnlyIfTaskExecuter.execute(SkipOnlyIfTaskExecuter.java:56)
error	23-Sep-2022 07:46:24		at org.gradle.api.internal.tasks.execution.CatchExceptionTaskExecuter.execute(CatchExceptionTaskExecuter.java:36)
error	23-Sep-2022 07:46:24		at org.gradle.api.internal.tasks.execution.EventFiringTaskExecuter$1.executeTask(EventFiringTaskExecuter.java:77)
error	23-Sep-2022 07:46:24		at org.gradle.api.internal.tasks.execution.EventFiringTaskExecuter$1.call(EventFiringTaskExecuter.java:55)
error	23-Sep-2022 07:46:24		at org.gradle.api.internal.tasks.execution.EventFiringTaskExecuter$1.call(EventFiringTaskExecuter.java:52)
error	23-Sep-2022 07:46:24		at org.gradle.internal.operations.DefaultBuildOperationExecutor$CallableBuildOperationWorker.execute(DefaultBuildOperationExecutor.java:409)
error	23-Sep-2022 07:46:24		at org.gradle.internal.operations.DefaultBuildOperationExecutor$CallableBuildOperationWorker.execute(DefaultBuildOperationExecutor.java:399)
error	23-Sep-2022 07:46:24		at org.gradle.internal.operations.DefaultBuildOperationExecutor$1.execute(DefaultBuildOperationExecutor.java:157)
error	23-Sep-2022 07:46:24		at org.gradle.internal.operations.DefaultBuildOperationExecutor.execute(DefaultBuildOperationExecutor.java:242)
error	23-Sep-2022 07:46:24		at org.gradle.internal.operations.DefaultBuildOperationExecutor.execute(DefaultBuildOperationExecutor.java:150)
error	23-Sep-2022 07:46:24		at org.gradle.internal.operations.DefaultBuildOperationExecutor.call(DefaultBuildOperationExecutor.java:94)
error	23-Sep-2022 07:46:24		at org.gradle.internal.operations.DelegatingBuildOperationExecutor.call(DelegatingBuildOperationExecutor.java:36)
error	23-Sep-2022 07:46:24		at org.gradle.api.internal.tasks.execution.EventFiringTaskExecuter.execute(EventFiringTaskExecuter.java:52)
error	23-Sep-2022 07:46:24		at org.gradle.execution.plan.LocalTaskNodeExecutor.execute(LocalTaskNodeExecutor.java:41)
error	23-Sep-2022 07:46:24		at org.gradle.execution.taskgraph.DefaultTaskExecutionGraph$InvokeNodeExecutorsAction.execute(DefaultTaskExecutionGraph.java:356)
error	23-Sep-2022 07:46:24		at org.gradle.execution.taskgraph.DefaultTaskExecutionGraph$InvokeNodeExecutorsAction.execute(DefaultTaskExecutionGraph.java:343)
error	23-Sep-2022 07:46:24		at org.gradle.execution.taskgraph.DefaultTaskExecutionGraph$BuildOperationAwareExecutionAction.execute(DefaultTaskExecutionGraph.java:336)
error	23-Sep-2022 07:46:24		at org.gradle.execution.taskgraph.DefaultTaskExecutionGraph$BuildOperationAwareExecutionAction.execute(DefaultTaskExecutionGraph.java:322)
error	23-Sep-2022 07:46:24		at org.gradle.execution.plan.DefaultPlanExecutor$ExecutorWorker.lambda$run$0(DefaultPlanExecutor.java:127)
error	23-Sep-2022 07:46:24		at org.gradle.execution.plan.DefaultPlanExecutor$ExecutorWorker.execute(DefaultPlanExecutor.java:191)
error	23-Sep-2022 07:46:24		at org.gradle.execution.plan.DefaultPlanExecutor$ExecutorWorker.executeNextNode(DefaultPlanExecutor.java:182)
error	23-Sep-2022 07:46:24		at org.gradle.execution.plan.DefaultPlanExecutor$ExecutorWorker.run(DefaultPlanExecutor.java:124)
error	23-Sep-2022 07:46:24		at org.gradle.execution.plan.DefaultPlanExecutor.process(DefaultPlanExecutor.java:72)
error	23-Sep-2022 07:46:24		at org.gradle.execution.taskgraph.DefaultTaskExecutionGraph.executeWithServices(DefaultTaskExecutionGraph.java:181)
error	23-Sep-2022 07:46:24		at org.gradle.execution.taskgraph.DefaultTaskExecutionGraph.execute(DefaultTaskExecutionGraph.java:174)
error	23-Sep-2022 07:46:24		at org.gradle.execution.SelectedTaskExecutionAction.execute(SelectedTaskExecutionAction.java:39)
error	23-Sep-2022 07:46:24		at org.gradle.execution.DefaultBuildWorkExecutor.execute(DefaultBuildWorkExecutor.java:40)
error	23-Sep-2022 07:46:24		at org.gradle.execution.DefaultBuildWorkExecutor.access$000(DefaultBuildWorkExecutor.java:24)
error	23-Sep-2022 07:46:24		at org.gradle.execution.DefaultBuildWorkExecutor$1.proceed(DefaultBuildWorkExecutor.java:48)
error	23-Sep-2022 07:46:24		at org.gradle.execution.DryRunBuildExecutionAction.execute(DryRunBuildExecutionAction.java:49)
error	23-Sep-2022 07:46:24		at org.gradle.execution.DefaultBuildWorkExecutor.execute(DefaultBuildWorkExecutor.java:40)
error	23-Sep-2022 07:46:24		at org.gradle.execution.DefaultBuildWorkExecutor.execute(DefaultBuildWorkExecutor.java:33)
error	23-Sep-2022 07:46:24		at org.gradle.execution.IncludedBuildLifecycleBuildWorkExecutor.execute(IncludedBuildLifecycleBuildWorkExecutor.java:36)
error	23-Sep-2022 07:46:24		at org.gradle.execution.DeprecateUndefinedBuildWorkExecutor.execute(DeprecateUndefinedBuildWorkExecutor.java:42)
error	23-Sep-2022 07:46:24		at org.gradle.execution.BuildOperationFiringBuildWorkerExecutor$ExecuteTasks.run(BuildOperationFiringBuildWorkerExecutor.java:57)
error	23-Sep-2022 07:46:24		at org.gradle.internal.operations.DefaultBuildOperationExecutor$RunnableBuildOperationWorker.execute(DefaultBuildOperationExecutor.java:395)
error	23-Sep-2022 07:46:24		at org.gradle.internal.operations.DefaultBuildOperationExecutor$RunnableBuildOperationWorker.execute(DefaultBuildOperationExecutor.java:387)
error	23-Sep-2022 07:46:24		at org.gradle.internal.operations.DefaultBuildOperationExecutor$1.execute(DefaultBuildOperationExecutor.java:157)
error	23-Sep-2022 07:46:24		at org.gradle.internal.operations.DefaultBuildOperationExecutor.execute(DefaultBuildOperationExecutor.java:242)
error	23-Sep-2022 07:46:24		at org.gradle.internal.operations.DefaultBuildOperationExecutor.execute(DefaultBuildOperationExecutor.java:150)
error	23-Sep-2022 07:46:24		at org.gradle.internal.operations.DefaultBuildOperationExecutor.run(DefaultBuildOperationExecutor.java:84)
error	23-Sep-2022 07:46:24		at org.gradle.internal.operations.DelegatingBuildOperationExecutor.run(DelegatingBuildOperationExecutor.java:31)
error	23-Sep-2022 07:46:24		at org.gradle.execution.BuildOperationFiringBuildWorkerExecutor.execute(BuildOperationFiringBuildWorkerExecutor.java:42)
error	23-Sep-2022 07:46:24		at org.gradle.initialization.DefaultGradleLauncher.runWork(DefaultGradleLauncher.java:257)
error	23-Sep-2022 07:46:24		at org.gradle.initialization.DefaultGradleLauncher.doClassicBuildStages(DefaultGradleLauncher.java:164)
error	23-Sep-2022 07:46:24		at org.gradle.initialization.DefaultGradleLauncher.doBuildStages(DefaultGradleLauncher.java:140)
error	23-Sep-2022 07:46:24		at org.gradle.initialization.DefaultGradleLauncher.executeTasks(DefaultGradleLauncher.java:120)
error	23-Sep-2022 07:46:24		at org.gradle.internal.invocation.GradleBuildController$1.create(GradleBuildController.java:74)
error	23-Sep-2022 07:46:24		at org.gradle.internal.invocation.GradleBuildController$1.create(GradleBuildController.java:67)
error	23-Sep-2022 07:46:24		at org.gradle.internal.work.DefaultWorkerLeaseService.withLocks(DefaultWorkerLeaseService.java:180)
error	23-Sep-2022 07:46:24		at org.gradle.internal.work.StopShieldingWorkerLeaseService.withLocks(StopShieldingWorkerLeaseService.java:40)
error	23-Sep-2022 07:46:24		at org.gradle.internal.invocation.GradleBuildController.doBuild(GradleBuildController.java:67)
error	23-Sep-2022 07:46:24		at org.gradle.internal.invocation.GradleBuildController.run(GradleBuildController.java:56)
error	23-Sep-2022 07:46:24		at org.gradle.tooling.internal.provider.ExecuteBuildActionRunner.run(ExecuteBuildActionRunner.java:31)
error	23-Sep-2022 07:46:24		at org.gradle.launcher.exec.ChainingBuildActionRunner.run(ChainingBuildActionRunner.java:35)
error	23-Sep-2022 07:46:24		at org.gradle.launcher.exec.BuildOutcomeReportingBuildActionRunner.run(BuildOutcomeReportingBuildActionRunner.java:63)
error	23-Sep-2022 07:46:24		at org.gradle.tooling.internal.provider.ValidatingBuildActionRunner.run(ValidatingBuildActionRunner.java:32)
error	23-Sep-2022 07:46:24		at org.gradle.launcher.exec.BuildCompletionNotifyingBuildActionRunner.run(BuildCompletionNotifyingBuildActionRunner.java:39)
error	23-Sep-2022 07:46:24		at org.gradle.launcher.exec.RunAsBuildOperationBuildActionRunner$3.call(RunAsBuildOperationBuildActionRunner.java:51)
error	23-Sep-2022 07:46:24		at org.gradle.launcher.exec.RunAsBuildOperationBuildActionRunner$3.call(RunAsBuildOperationBuildActionRunner.java:45)
error	23-Sep-2022 07:46:24		at org.gradle.internal.operations.DefaultBuildOperationExecutor$CallableBuildOperationWorker.execute(DefaultBuildOperationExecutor.java:409)
error	23-Sep-2022 07:46:24		at org.gradle.internal.operations.DefaultBuildOperationExecutor$CallableBuildOperationWorker.execute(DefaultBuildOperationExecutor.java:399)
error	23-Sep-2022 07:46:24		at org.gradle.internal.operations.DefaultBuildOperationExecutor$1.execute(DefaultBuildOperationExecutor.java:157)
error	23-Sep-2022 07:46:24		at org.gradle.internal.operations.DefaultBuildOperationExecutor.execute(DefaultBuildOperationExecutor.java:242)
error	23-Sep-2022 07:46:24		at org.gradle.internal.operations.DefaultBuildOperationExecutor.execute(DefaultBuildOperationExecutor.java:150)
error	23-Sep-2022 07:46:24		at org.gradle.internal.operations.DefaultBuildOperationExecutor.call(DefaultBuildOperationExecutor.java:94)
error	23-Sep-2022 07:46:24		at org.gradle.internal.operations.DelegatingBuildOperationExecutor.call(DelegatingBuildOperationExecutor.java:36)
error	23-Sep-2022 07:46:24		at org.gradle.launcher.exec.RunAsBuildOperationBuildActionRunner.run(RunAsBuildOperationBuildActionRunner.java:45)
error	23-Sep-2022 07:46:24		at org.gradle.launcher.exec.InProcessBuildActionExecuter$1.transform(InProcessBuildActionExecuter.java:50)
error	23-Sep-2022 07:46:24		at org.gradle.launcher.exec.InProcessBuildActionExecuter$1.transform(InProcessBuildActionExecuter.java:47)
error	23-Sep-2022 07:46:24		at org.gradle.composite.internal.DefaultRootBuildState.run(DefaultRootBuildState.java:80)
error	23-Sep-2022 07:46:24		at org.gradle.launcher.exec.InProcessBuildActionExecuter.execute(InProcessBuildActionExecuter.java:47)
error	23-Sep-2022 07:46:24		at org.gradle.launcher.exec.InProcessBuildActionExecuter.execute(InProcessBuildActionExecuter.java:31)
error	23-Sep-2022 07:46:24		at org.gradle.launcher.exec.BuildTreeScopeBuildActionExecuter.execute(BuildTreeScopeBuildActionExecuter.java:42)
error	23-Sep-2022 07:46:24		at org.gradle.launcher.exec.BuildTreeScopeBuildActionExecuter.execute(BuildTreeScopeBuildActionExecuter.java:28)
error	23-Sep-2022 07:46:24		at org.gradle.tooling.internal.provider.ContinuousBuildActionExecuter.execute(ContinuousBuildActionExecuter.java:87)
error	23-Sep-2022 07:46:24		at org.gradle.tooling.internal.provider.ContinuousBuildActionExecuter.execute(ContinuousBuildActionExecuter.java:55)
error	23-Sep-2022 07:46:24		at org.gradle.tooling.internal.provider.SubscribableBuildActionExecuter.execute(SubscribableBuildActionExecuter.java:60)
error	23-Sep-2022 07:46:24		at org.gradle.tooling.internal.provider.SubscribableBuildActionExecuter.execute(SubscribableBuildActionExecuter.java:38)
error	23-Sep-2022 07:46:24		at org.gradle.tooling.internal.provider.SessionScopeBuildActionExecuter.execute(SessionScopeBuildActionExecuter.java:68)
error	23-Sep-2022 07:46:24		at org.gradle.tooling.internal.provider.SessionScopeBuildActionExecuter.execute(SessionScopeBuildActionExecuter.java:38)
error	23-Sep-2022 07:46:24		at org.gradle.tooling.internal.provider.GradleThreadBuildActionExecuter.execute(GradleThreadBuildActionExecuter.java:37)
error	23-Sep-2022 07:46:24		at org.gradle.tooling.internal.provider.GradleThreadBuildActionExecuter.execute(GradleThreadBuildActionExecuter.java:26)
error	23-Sep-2022 07:46:24		at org.gradle.tooling.internal.provider.StartParamsValidatingActionExecuter.execute(StartParamsValidatingActionExecuter.java:60)
error	23-Sep-2022 07:46:24		at org.gradle.tooling.internal.provider.StartParamsValidatingActionExecuter.execute(StartParamsValidatingActionExecuter.java:32)
error	23-Sep-2022 07:46:24		at org.gradle.tooling.internal.provider.SessionFailureReportingActionExecuter.execute(SessionFailureReportingActionExecuter.java:56)
error	23-Sep-2022 07:46:24		at org.gradle.tooling.internal.provider.SessionFailureReportingActionExecuter.execute(SessionFailureReportingActionExecuter.java:42)
error	23-Sep-2022 07:46:24		at org.gradle.tooling.internal.provider.SetupLoggingActionExecuter.execute(SetupLoggingActionExecuter.java:48)
error	23-Sep-2022 07:46:24		at org.gradle.tooling.internal.provider.SetupLoggingActionExecuter.execute(SetupLoggingActionExecuter.java:32)
error	23-Sep-2022 07:46:24		at org.gradle.launcher.daemon.server.exec.ExecuteBuild.doBuild(ExecuteBuild.java:68)
error	23-Sep-2022 07:46:24		at org.gradle.launcher.daemon.server.exec.BuildCommandOnly.execute(BuildCommandOnly.java:37)
error	23-Sep-2022 07:46:24		at org.gradle.launcher.daemon.server.api.DaemonCommandExecution.proceed(DaemonCommandExecution.java:104)
error	23-Sep-2022 07:46:24		at org.gradle.launcher.daemon.server.exec.WatchForDisconnection.execute(WatchForDisconnection.java:39)
error	23-Sep-2022 07:46:24		at org.gradle.launcher.daemon.server.api.DaemonCommandExecution.proceed(DaemonCommandExecution.java:104)
error	23-Sep-2022 07:46:24		at org.gradle.launcher.daemon.server.exec.ResetDeprecationLogger.execute(ResetDeprecationLogger.java:29)
error	23-Sep-2022 07:46:24		at org.gradle.launcher.daemon.server.api.DaemonCommandExecution.proceed(DaemonCommandExecution.java:104)
error	23-Sep-2022 07:46:24		at org.gradle.launcher.daemon.server.exec.RequestStopIfSingleUsedDaemon.execute(RequestStopIfSingleUsedDaemon.java:35)
error	23-Sep-2022 07:46:24		at org.gradle.launcher.daemon.server.api.DaemonCommandExecution.proceed(DaemonCommandExecution.java:104)
error	23-Sep-2022 07:46:24		at org.gradle.launcher.daemon.server.exec.ForwardClientInput$2.create(ForwardClientInput.java:78)
error	23-Sep-2022 07:46:24		at org.gradle.launcher.daemon.server.exec.ForwardClientInput$2.create(ForwardClientInput.java:75)
error	23-Sep-2022 07:46:24		at org.gradle.util.Swapper.swap(Swapper.java:38)
error	23-Sep-2022 07:46:24		at org.gradle.launcher.daemon.server.exec.ForwardClientInput.execute(ForwardClientInput.java:75)
error	23-Sep-2022 07:46:24		at org.gradle.launcher.daemon.server.api.DaemonCommandExecution.proceed(DaemonCommandExecution.java:104)
error	23-Sep-2022 07:46:24		at org.gradle.launcher.daemon.server.exec.LogAndCheckHealth.execute(LogAndCheckHealth.java:55)
error	23-Sep-2022 07:46:24		at org.gradle.launcher.daemon.server.api.DaemonCommandExecution.proceed(DaemonCommandExecution.java:104)
error	23-Sep-2022 07:46:24		at org.gradle.launcher.daemon.server.exec.LogToClient.doBuild(LogToClient.java:63)
error	23-Sep-2022 07:46:24		at org.gradle.launcher.daemon.server.exec.BuildCommandOnly.execute(BuildCommandOnly.java:37)
error	23-Sep-2022 07:46:24		at org.gradle.launcher.daemon.server.api.DaemonCommandExecution.proceed(DaemonCommandExecution.java:104)
error	23-Sep-2022 07:46:24		at org.gradle.launcher.daemon.server.exec.EstablishBuildEnvironment.doBuild(EstablishBuildEnvironment.java:82)
error	23-Sep-2022 07:46:24		at org.gradle.launcher.daemon.server.exec.BuildCommandOnly.execute(BuildCommandOnly.java:37)
error	23-Sep-2022 07:46:24		at org.gradle.launcher.daemon.server.api.DaemonCommandExecution.proceed(DaemonCommandExecution.java:104)
error	23-Sep-2022 07:46:24		at org.gradle.launcher.daemon.server.exec.StartBuildOrRespondWithBusy$1.run(StartBuildOrRespondWithBusy.java:52)
error	23-Sep-2022 07:46:24		at org.gradle.launcher.daemon.server.DaemonStateCoordinator$1.run(DaemonStateCoordinator.java:297)
error	23-Sep-2022 07:46:24		at org.gradle.internal.concurrent.ExecutorPolicy$CatchAndRecordFailures.onExecute(ExecutorPolicy.java:64)
error	23-Sep-2022 07:46:24		at org.gradle.internal.concurrent.ManagedExecutorImpl$1.run(ManagedExecutorImpl.java:48)
error	23-Sep-2022 07:46:24		at org.gradle.internal.concurrent.ThreadFactoryImpl$ManagedThreadRunnable.run(ThreadFactoryImpl.java:56)
error	23-Sep-2022 07:46:24	Caused by: java.lang.IllegalStateException: Fail to request url: https://url/sonarqube/api/ce/submit?projectKey=kkp3&projectName=kkp3%20-%20sonarqube-test
error	23-Sep-2022 07:46:24		at org.sonarqube.ws.client.HttpConnector.doCall(HttpConnector.java:205)
error	23-Sep-2022 07:46:24		at org.sonarqube.ws.client.HttpConnector.post(HttpConnector.java:155)
error	23-Sep-2022 07:46:24		at org.sonarqube.ws.client.HttpConnector.call(HttpConnector.java:114)
error	23-Sep-2022 07:46:24		at org.sonar.scanner.bootstrap.DefaultScannerWsClient.call(DefaultScannerWsClient.java:73)
error	23-Sep-2022 07:46:24		at org.sonar.scanner.report.ReportPublisher.upload(ReportPublisher.java:204)
error	23-Sep-2022 07:46:24		at org.sonar.scanner.report.ReportPublisher.execute(ReportPublisher.java:141)
error	23-Sep-2022 07:46:24		at org.sonar.scanner.scan.ProjectScanContainer.doAfterStart(ProjectScanContainer.java:365)
error	23-Sep-2022 07:46:24		at org.sonar.core.platform.ComponentContainer.startComponents(ComponentContainer.java:137)
error	23-Sep-2022 07:46:24		at org.sonar.core.platform.ComponentContainer.execute(ComponentContainer.java:123)
error	23-Sep-2022 07:46:24		at org.sonar.scanner.bootstrap.GlobalContainer.doAfterStart(GlobalContainer.java:150)
error	23-Sep-2022 07:46:24		at org.sonar.core.platform.ComponentContainer.startComponents(ComponentContainer.java:137)
error	23-Sep-2022 07:46:24		at org.sonar.core.platform.ComponentContainer.execute(ComponentContainer.java:123)
error	23-Sep-2022 07:46:24		at org.sonar.batch.bootstrapper.Batch.doExecute(Batch.java:72)
error	23-Sep-2022 07:46:24		at org.sonar.batch.bootstrapper.Batch.execute(Batch.java:66)
error	23-Sep-2022 07:46:24		at org.sonarsource.scanner.api.internal.batch.BatchIsolatedLauncher.execute(BatchIsolatedLauncher.java:46)
error	23-Sep-2022 07:46:24		at java.base/jdk.internal.reflect.NativeMethodAccessorImpl.invoke0(Native Method)
error	23-Sep-2022 07:46:24		at java.base/jdk.internal.reflect.NativeMethodAccessorImpl.invoke(NativeMethodAccessorImpl.java:62)
error	23-Sep-2022 07:46:24		at java.base/jdk.internal.reflect.DelegatingMethodAccessorImpl.invoke(DelegatingMethodAccessorImpl.java:43)
error	23-Sep-2022 07:46:24		at org.sonarsource.scanner.api.internal.IsolatedLauncherProxy.invoke(IsolatedLauncherProxy.java:60)
error	23-Sep-2022 07:46:24		at com.sun.proxy.$Proxy84.execute(Unknown Source)
error	23-Sep-2022 07:46:24		at org.sonarsource.scanner.api.EmbeddedScanner.doExecute(EmbeddedScanner.java:189)
error	23-Sep-2022 07:46:24		at org.sonarsource.scanner.api.EmbeddedScanner.execute(EmbeddedScanner.java:138)
error	23-Sep-2022 07:46:24		at org.sonarqube.gradle.SonarQubeTask.run(SonarQubeTask.java:100)
error	23-Sep-2022 07:46:24		at java.base/jdk.internal.reflect.NativeMethodAccessorImpl.invoke0(Native Method)
error	23-Sep-2022 07:46:24		at java.base/jdk.internal.reflect.NativeMethodAccessorImpl.invoke(NativeMethodAccessorImpl.java:62)
error	23-Sep-2022 07:46:24		at java.base/jdk.internal.reflect.DelegatingMethodAccessorImpl.invoke(DelegatingMethodAccessorImpl.java:43)
error	23-Sep-2022 07:46:24		at org.gradle.internal.reflect.JavaMethod.invoke(JavaMethod.java:104)
error	23-Sep-2022 07:46:24		at org.gradle.api.internal.project.taskfactory.StandardTaskAction.doExecute(StandardTaskAction.java:49)
error	23-Sep-2022 07:46:24		at org.gradle.api.internal.project.taskfactory.StandardTaskAction.execute(StandardTaskAction.java:42)
error	23-Sep-2022 07:46:24		at org.gradle.api.internal.project.taskfactory.StandardTaskAction.execute(StandardTaskAction.java:28)
error	23-Sep-2022 07:46:24		at org.gradle.api.internal.AbstractTask$TaskActionWrapper.execute(AbstractTask.java:726)
error	23-Sep-2022 07:46:24		at org.gradle.api.internal.AbstractTask$TaskActionWrapper.execute(AbstractTask.java:693)
error	23-Sep-2022 07:46:24		at org.gradle.api.internal.tasks.execution.ExecuteActionsTaskExecuter$3.run(ExecuteActionsTaskExecuter.java:569)
error	23-Sep-2022 07:46:24		at org.gradle.internal.operations.DefaultBuildOperationExecutor$RunnableBuildOperationWorker.execute(DefaultBuildOperationExecutor.java:395)
error	23-Sep-2022 07:46:24		at org.gradle.internal.operations.DefaultBuildOperationExecutor$RunnableBuildOperationWorker.execute(DefaultBuildOperationExecutor.java:387)
error	23-Sep-2022 07:46:24		at org.gradle.internal.operations.DefaultBuildOperationExecutor$1.execute(DefaultBuildOperationExecutor.java:157)
error	23-Sep-2022 07:46:24		at org.gradle.internal.operations.DefaultBuildOperationExecutor.execute(DefaultBuildOperationExecutor.java:242)
error	23-Sep-2022 07:46:24		at org.gradle.internal.operations.DefaultBuildOperationExecutor.execute(DefaultBuildOperationExecutor.java:150)
error	23-Sep-2022 07:46:24		at org.gradle.internal.operations.DefaultBuildOperationExecutor.run(DefaultBuildOperationExecutor.java:84)
error	23-Sep-2022 07:46:24		at org.gradle.internal.operations.DelegatingBuildOperationExecutor.run(DelegatingBuildOperationExecutor.java:31)
error	23-Sep-2022 07:46:24		at org.gradle.api.internal.tasks.execution.ExecuteActionsTaskExecuter.executeAction(ExecuteActionsTaskExecuter.java:554)
error	23-Sep-2022 07:46:24		at org.gradle.api.internal.tasks.execution.ExecuteActionsTaskExecuter.executeActions(ExecuteActionsTaskExecuter.java:537)
error	23-Sep-2022 07:46:24		at org.gradle.api.internal.tasks.execution.ExecuteActionsTaskExecuter.access$300(ExecuteActionsTaskExecuter.java:108)
error	23-Sep-2022 07:46:24		at org.gradle.api.internal.tasks.execution.ExecuteActionsTaskExecuter$TaskExecution.executeWithPreviousOutputFiles(ExecuteActionsTaskExecuter.java:278)
error	23-Sep-2022 07:46:24		at org.gradle.api.internal.tasks.execution.ExecuteActionsTaskExecuter$TaskExecution.execute(ExecuteActionsTaskExecuter.java:267)
error	23-Sep-2022 07:46:24		at org.gradle.internal.execution.steps.ExecuteStep.lambda$execute$1(ExecuteStep.java:33)
error	23-Sep-2022 07:46:24		at org.gradle.internal.execution.steps.ExecuteStep.execute(ExecuteStep.java:33)
error	23-Sep-2022 07:46:24		at org.gradle.internal.execution.steps.ExecuteStep.execute(ExecuteStep.java:26)
error	23-Sep-2022 07:46:24		at org.gradle.internal.execution.steps.CleanupOutputsStep.execute(CleanupOutputsStep.java:67)
error	23-Sep-2022 07:46:24		at org.gradle.internal.execution.steps.CleanupOutputsStep.execute(CleanupOutputsStep.java:36)
error	23-Sep-2022 07:46:24		at org.gradle.internal.execution.steps.ResolveInputChangesStep.execute(ResolveInputChangesStep.java:49)
error	23-Sep-2022 07:46:24		at org.gradle.internal.execution.steps.ResolveInputChangesStep.execute(ResolveInputChangesStep.java:34)
error	23-Sep-2022 07:46:24		at org.gradle.internal.execution.steps.CancelExecutionStep.execute(CancelExecutionStep.java:43)
error	23-Sep-2022 07:46:24		at org.gradle.internal.execution.steps.TimeoutStep.executeWithoutTimeout(TimeoutStep.java:73)
error	23-Sep-2022 07:46:24		at org.gradle.internal.execution.steps.TimeoutStep.execute(TimeoutStep.java:54)
error	23-Sep-2022 07:46:24		at org.gradle.internal.execution.steps.CatchExceptionStep.execute(CatchExceptionStep.java:34)
error	23-Sep-2022 07:46:24		at org.gradle.internal.execution.steps.CreateOutputsStep.execute(CreateOutputsStep.java:44)
error	23-Sep-2022 07:46:24		at org.gradle.internal.execution.steps.SnapshotOutputsStep.execute(SnapshotOutputsStep.java:54)
error	23-Sep-2022 07:46:24		at org.gradle.internal.execution.steps.SnapshotOutputsStep.execute(SnapshotOutputsStep.java:38)
error	23-Sep-2022 07:46:24		at org.gradle.internal.execution.steps.BroadcastChangingOutputsStep.execute(BroadcastChangingOutputsStep.java:49)
error	23-Sep-2022 07:46:24		at org.gradle.internal.execution.steps.CacheStep.executeWithoutCache(CacheStep.java:159)
error	23-Sep-2022 07:46:24		at org.gradle.internal.execution.steps.CacheStep.execute(CacheStep.java:72)
error	23-Sep-2022 07:46:24		at org.gradle.internal.execution.steps.CacheStep.execute(CacheStep.java:43)
error	23-Sep-2022 07:46:24		at org.gradle.internal.execution.steps.StoreExecutionStateStep.execute(StoreExecutionStateStep.java:44)
error	23-Sep-2022 07:46:24		at org.gradle.internal.execution.steps.StoreExecutionStateStep.execute(StoreExecutionStateStep.java:33)
error	23-Sep-2022 07:46:24		at org.gradle.internal.execution.steps.RecordOutputsStep.execute(RecordOutputsStep.java:38)
error	23-Sep-2022 07:46:24		at org.gradle.internal.execution.steps.RecordOutputsStep.execute(RecordOutputsStep.java:24)
error	23-Sep-2022 07:46:24		at org.gradle.internal.execution.steps.SkipUpToDateStep.executeBecause(SkipUpToDateStep.java:92)
error	23-Sep-2022 07:46:24		at org.gradle.internal.execution.steps.SkipUpToDateStep.lambda$execute$0(SkipUpToDateStep.java:85)
error	23-Sep-2022 07:46:24		at org.gradle.internal.execution.steps.SkipUpToDateStep.execute(SkipUpToDateStep.java:55)
error	23-Sep-2022 07:46:24		at org.gradle.internal.execution.steps.SkipUpToDateStep.execute(SkipUpToDateStep.java:39)
error	23-Sep-2022 07:46:24		at org.gradle.internal.execution.steps.ResolveChangesStep.execute(ResolveChangesStep.java:76)
error	23-Sep-2022 07:46:24		at org.gradle.internal.execution.steps.ResolveChangesStep.execute(ResolveChangesStep.java:37)
error	23-Sep-2022 07:46:24		at org.gradle.internal.execution.steps.legacy.MarkSnapshottingInputsFinishedStep.execute(MarkSnapshottingInputsFinishedStep.java:36)
error	23-Sep-2022 07:46:24		at org.gradle.internal.execution.steps.legacy.MarkSnapshottingInputsFinishedStep.execute(MarkSnapshottingInputsFinishedStep.java:26)
error	23-Sep-2022 07:46:24		at org.gradle.internal.execution.steps.ResolveCachingStateStep.execute(ResolveCachingStateStep.java:94)
error	23-Sep-2022 07:46:24		at org.gradle.internal.execution.steps.ResolveCachingStateStep.execute(ResolveCachingStateStep.java:49)
error	23-Sep-2022 07:46:24		at org.gradle.internal.execution.steps.CaptureStateBeforeExecutionStep.execute(CaptureStateBeforeExecutionStep.java:79)
error	23-Sep-2022 07:46:24		at org.gradle.internal.execution.steps.CaptureStateBeforeExecutionStep.execute(CaptureStateBeforeExecutionStep.java:53)
error	23-Sep-2022 07:46:24		at org.gradle.internal.execution.steps.ValidateStep.execute(ValidateStep.java:74)
error	23-Sep-2022 07:46:24		at org.gradle.internal.execution.steps.SkipEmptyWorkStep.lambda$execute$2(SkipEmptyWorkStep.java:78)
error	23-Sep-2022 07:46:24		at org.gradle.internal.execution.steps.SkipEmptyWorkStep.execute(SkipEmptyWorkStep.java:78)
error	23-Sep-2022 07:46:24		at org.gradle.internal.execution.steps.SkipEmptyWorkStep.execute(SkipEmptyWorkStep.java:34)
error	23-Sep-2022 07:46:24		at org.gradle.internal.execution.steps.legacy.MarkSnapshottingInputsStartedStep.execute(MarkSnapshottingInputsStartedStep.java:39)
error	23-Sep-2022 07:46:24		at org.gradle.internal.execution.steps.LoadExecutionStateStep.execute(LoadExecutionStateStep.java:40)
error	23-Sep-2022 07:46:24		at org.gradle.internal.execution.steps.LoadExecutionStateStep.execute(LoadExecutionStateStep.java:28)
error	23-Sep-2022 07:46:24		at org.gradle.internal.execution.impl.DefaultWorkExecutor.execute(DefaultWorkExecutor.java:33)
error	23-Sep-2022 07:46:24		at org.gradle.api.internal.tasks.execution.ExecuteActionsTaskExecuter.executeIfValid(ExecuteActionsTaskExecuter.java:194)
error	23-Sep-2022 07:46:24		at org.gradle.api.internal.tasks.execution.ExecuteActionsTaskExecuter.execute(ExecuteActionsTaskExecuter.java:186)
error	23-Sep-2022 07:46:24		at org.gradle.api.internal.tasks.execution.CleanupStaleOutputsExecuter.execute(CleanupStaleOutputsExecuter.java:114)
error	23-Sep-2022 07:46:24		at org.gradle.api.internal.tasks.execution.FinalizePropertiesTaskExecuter.execute(FinalizePropertiesTaskExecuter.java:46)
error	23-Sep-2022 07:46:24		at org.gradle.api.internal.tasks.execution.ResolveTaskExecutionModeExecuter.execute(ResolveTaskExecutionModeExecuter.java:62)
error	23-Sep-2022 07:46:24		at org.gradle.api.internal.tasks.execution.SkipTaskWithNoActionsExecuter.execute(SkipTaskWithNoActionsExecuter.java:57)
error	23-Sep-2022 07:46:24		at org.gradle.api.internal.tasks.execution.SkipOnlyIfTaskExecuter.execute(SkipOnlyIfTaskExecuter.java:56)
error	23-Sep-2022 07:46:24		at org.gradle.api.internal.tasks.execution.CatchExceptionTaskExecuter.execute(CatchExceptionTaskExecuter.java:36)
error	23-Sep-2022 07:46:24		at org.gradle.api.internal.tasks.execution.EventFiringTaskExecuter$1.executeTask(EventFiringTaskExecuter.java:77)
error	23-Sep-2022 07:46:24		at org.gradle.api.internal.tasks.execution.EventFiringTaskExecuter$1.call(EventFiringTaskExecuter.java:55)
error	23-Sep-2022 07:46:24		at org.gradle.api.internal.tasks.execution.EventFiringTaskExecuter$1.call(EventFiringTaskExecuter.java:52)
error	23-Sep-2022 07:46:24		at org.gradle.internal.operations.DefaultBuildOperationExecutor$CallableBuildOperationWorker.execute(DefaultBuildOperationExecutor.java:409)
error	23-Sep-2022 07:46:24		at org.gradle.internal.operations.DefaultBuildOperationExecutor$CallableBuildOperationWorker.execute(DefaultBuildOperationExecutor.java:399)
error	23-Sep-2022 07:46:24		at org.gradle.internal.operations.DefaultBuildOperationExecutor$1.execute(DefaultBuildOperationExecutor.java:157)
error	23-Sep-2022 07:46:24		at org.gradle.internal.operations.DefaultBuildOperationExecutor.execute(DefaultBuildOperationExecutor.java:242)
error	23-Sep-2022 07:46:24		at org.gradle.internal.operations.DefaultBuildOperationExecutor.execute(DefaultBuildOperationExecutor.java:150)
error	23-Sep-2022 07:46:24		at org.gradle.internal.operations.DefaultBuildOperationExecutor.call(DefaultBuildOperationExecutor.java:94)
error	23-Sep-2022 07:46:24		at org.gradle.internal.operations.DelegatingBuildOperationExecutor.call(DelegatingBuildOperationExecutor.java:36)
error	23-Sep-2022 07:46:24		at org.gradle.api.internal.tasks.execution.EventFiringTaskExecuter.execute(EventFiringTaskExecuter.java:52)
error	23-Sep-2022 07:46:24		at org.gradle.execution.plan.LocalTaskNodeExecutor.execute(LocalTaskNodeExecutor.java:41)
error	23-Sep-2022 07:46:24		at org.gradle.execution.taskgraph.DefaultTaskExecutionGraph$InvokeNodeExecutorsAction.execute(DefaultTaskExecutionGraph.java:356)
error	23-Sep-2022 07:46:24		at org.gradle.execution.taskgraph.DefaultTaskExecutionGraph$InvokeNodeExecutorsAction.execute(DefaultTaskExecutionGraph.java:343)
error	23-Sep-2022 07:46:24		at org.gradle.execution.taskgraph.DefaultTaskExecutionGraph$BuildOperationAwareExecutionAction.execute(DefaultTaskExecutionGraph.java:336)
error	23-Sep-2022 07:46:24		at org.gradle.execution.taskgraph.DefaultTaskExecutionGraph$BuildOperationAwareExecutionAction.execute(DefaultTaskExecutionGraph.java:322)
error	23-Sep-2022 07:46:24		at org.gradle.execution.plan.DefaultPlanExecutor$ExecutorWorker.lambda$run$0(DefaultPlanExecutor.java:127)
error	23-Sep-2022 07:46:24		at org.gradle.execution.plan.DefaultPlanExecutor$ExecutorWorker.execute(DefaultPlanExecutor.java:191)
error	23-Sep-2022 07:46:24		at org.gradle.execution.plan.DefaultPlanExecutor$ExecutorWorker.executeNextNode(DefaultPlanExecutor.java:182)
error	23-Sep-2022 07:46:24		at org.gradle.execution.plan.DefaultPlanExecutor$ExecutorWorker.run(DefaultPlanExecutor.java:124)
error	23-Sep-2022 07:46:24		at org.gradle.execution.plan.DefaultPlanExecutor.process(DefaultPlanExecutor.java:72)
error	23-Sep-2022 07:46:24		at org.gradle.execution.taskgraph.DefaultTaskExecutionGraph.executeWithServices(DefaultTaskExecutionGraph.java:181)
error	23-Sep-2022 07:46:24		at org.gradle.execution.taskgraph.DefaultTaskExecutionGraph.execute(DefaultTaskExecutionGraph.java:174)
error	23-Sep-2022 07:46:24		at org.gradle.execution.SelectedTaskExecutionAction.execute(SelectedTaskExecutionAction.java:39)
error	23-Sep-2022 07:46:24		at org.gradle.execution.DefaultBuildWorkExecutor.execute(DefaultBuildWorkExecutor.java:40)
error	23-Sep-2022 07:46:24		at org.gradle.execution.DefaultBuildWorkExecutor.access$000(DefaultBuildWorkExecutor.java:24)
error	23-Sep-2022 07:46:24		at org.gradle.execution.DefaultBuildWorkExecutor$1.proceed(DefaultBuildWorkExecutor.java:48)
error	23-Sep-2022 07:46:24		at org.gradle.execution.DryRunBuildExecutionAction.execute(DryRunBuildExecutionAction.java:49)
error	23-Sep-2022 07:46:24		at org.gradle.execution.DefaultBuildWorkExecutor.execute(DefaultBuildWorkExecutor.java:40)
error	23-Sep-2022 07:46:24		at org.gradle.execution.DefaultBuildWorkExecutor.execute(DefaultBuildWorkExecutor.java:33)
error	23-Sep-2022 07:46:24		at org.gradle.execution.IncludedBuildLifecycleBuildWorkExecutor.execute(IncludedBuildLifecycleBuildWorkExecutor.java:36)
error	23-Sep-2022 07:46:24		at org.gradle.execution.DeprecateUndefinedBuildWorkExecutor.execute(DeprecateUndefinedBuildWorkExecutor.java:42)
error	23-Sep-2022 07:46:24		at org.gradle.execution.BuildOperationFiringBuildWorkerExecutor$ExecuteTasks.run(BuildOperationFiringBuildWorkerExecutor.java:57)
error	23-Sep-2022 07:46:24		at org.gradle.internal.operations.DefaultBuildOperationExecutor$RunnableBuildOperationWorker.execute(DefaultBuildOperationExecutor.java:395)
error	23-Sep-2022 07:46:24		at org.gradle.internal.operations.DefaultBuildOperationExecutor$RunnableBuildOperationWorker.execute(DefaultBuildOperationExecutor.java:387)
error	23-Sep-2022 07:46:24		at org.gradle.internal.operations.DefaultBuildOperationExecutor$1.execute(DefaultBuildOperationExecutor.java:157)
error	23-Sep-2022 07:46:24		at org.gradle.internal.operations.DefaultBuildOperationExecutor.execute(DefaultBuildOperationExecutor.java:242)
error	23-Sep-2022 07:46:24		at org.gradle.internal.operations.DefaultBuildOperationExecutor.execute(DefaultBuildOperationExecutor.java:150)
error	23-Sep-2022 07:46:24		at org.gradle.internal.operations.DefaultBuildOperationExecutor.run(DefaultBuildOperationExecutor.java:84)
error	23-Sep-2022 07:46:24		at org.gradle.internal.operations.DelegatingBuildOperationExecutor.run(DelegatingBuildOperationExecutor.java:31)
error	23-Sep-2022 07:46:24		at org.gradle.execution.BuildOperationFiringBuildWorkerExecutor.execute(BuildOperationFiringBuildWorkerExecutor.java:42)
error	23-Sep-2022 07:46:24		at org.gradle.initialization.DefaultGradleLauncher.runWork(DefaultGradleLauncher.java:257)
error	23-Sep-2022 07:46:24		at org.gradle.initialization.DefaultGradleLauncher.doClassicBuildStages(DefaultGradleLauncher.java:164)
error	23-Sep-2022 07:46:24		at org.gradle.initialization.DefaultGradleLauncher.doBuildStages(DefaultGradleLauncher.java:140)
error	23-Sep-2022 07:46:24		at org.gradle.initialization.DefaultGradleLauncher.executeTasks(DefaultGradleLauncher.java:120)
error	23-Sep-2022 07:46:24		at org.gradle.internal.invocation.GradleBuildController$1.create(GradleBuildController.java:74)
error	23-Sep-2022 07:46:24		at org.gradle.internal.invocation.GradleBuildController$1.create(GradleBuildController.java:67)
error	23-Sep-2022 07:46:24		at org.gradle.internal.work.DefaultWorkerLeaseService.withLocks(DefaultWorkerLeaseService.java:180)
error	23-Sep-2022 07:46:24		at org.gradle.internal.work.StopShieldingWorkerLeaseService.withLocks(StopShieldingWorkerLeaseService.java:40)
error	23-Sep-2022 07:46:24		at org.gradle.internal.invocation.GradleBuildController.doBuild(GradleBuildController.java:67)
error	23-Sep-2022 07:46:24		at org.gradle.internal.invocation.GradleBuildController.run(GradleBuildController.java:56)
error	23-Sep-2022 07:46:24		at org.gradle.tooling.internal.provider.ExecuteBuildActionRunner.run(ExecuteBuildActionRunner.java:31)
error	23-Sep-2022 07:46:24		at org.gradle.launcher.exec.ChainingBuildActionRunner.run(ChainingBuildActionRunner.java:35)
error	23-Sep-2022 07:46:24		at org.gradle.launcher.exec.BuildOutcomeReportingBuildActionRunner.run(BuildOutcomeReportingBuildActionRunner.java:63)
error	23-Sep-2022 07:46:24		at org.gradle.tooling.internal.provider.ValidatingBuildActionRunner.run(ValidatingBuildActionRunner.java:32)
error	23-Sep-2022 07:46:24		at org.gradle.launcher.exec.BuildCompletionNotifyingBuildActionRunner.run(BuildCompletionNotifyingBuildActionRunner.java:39)
error	23-Sep-2022 07:46:24		at org.gradle.launcher.exec.RunAsBuildOperationBuildActionRunner$3.call(RunAsBuildOperationBuildActionRunner.java:51)
error	23-Sep-2022 07:46:24		at org.gradle.launcher.exec.RunAsBuildOperationBuildActionRunner$3.call(RunAsBuildOperationBuildActionRunner.java:45)
error	23-Sep-2022 07:46:24		at org.gradle.internal.operations.DefaultBuildOperationExecutor$CallableBuildOperationWorker.execute(DefaultBuildOperationExecutor.java:409)
error	23-Sep-2022 07:46:24		at org.gradle.internal.operations.DefaultBuildOperationExecutor$CallableBuildOperationWorker.execute(DefaultBuildOperationExecutor.java:399)
error	23-Sep-2022 07:46:24		at org.gradle.internal.operations.DefaultBuildOperationExecutor$1.execute(DefaultBuildOperationExecutor.java:157)
error	23-Sep-2022 07:46:24		at org.gradle.internal.operations.DefaultBuildOperationExecutor.execute(DefaultBuildOperationExecutor.java:242)
error	23-Sep-2022 07:46:24		at org.gradle.internal.operations.DefaultBuildOperationExecutor.execute(DefaultBuildOperationExecutor.java:150)
error	23-Sep-2022 07:46:24		at org.gradle.internal.operations.DefaultBuildOperationExecutor.call(DefaultBuildOperationExecutor.java:94)
error	23-Sep-2022 07:46:24		at org.gradle.internal.operations.DelegatingBuildOperationExecutor.call(DelegatingBuildOperationExecutor.java:36)
error	23-Sep-2022 07:46:24		at org.gradle.launcher.exec.RunAsBuildOperationBuildActionRunner.run(RunAsBuildOperationBuildActionRunner.java:45)
error	23-Sep-2022 07:46:24		at org.gradle.launcher.exec.InProcessBuildActionExecuter$1.transform(InProcessBuildActionExecuter.java:50)
error	23-Sep-2022 07:46:24		at org.gradle.launcher.exec.InProcessBuildActionExecuter$1.transform(InProcessBuildActionExecuter.java:47)
error	23-Sep-2022 07:46:24		at org.gradle.composite.internal.DefaultRootBuildState.run(DefaultRootBuildState.java:80)
error	23-Sep-2022 07:46:24		at org.gradle.launcher.exec.InProcessBuildActionExecuter.execute(InProcessBuildActionExecuter.java:47)
error	23-Sep-2022 07:46:24		at org.gradle.launcher.exec.InProcessBuildActionExecuter.execute(InProcessBuildActionExecuter.java:31)
error	23-Sep-2022 07:46:24		at org.gradle.launcher.exec.BuildTreeScopeBuildActionExecuter.execute(BuildTreeScopeBuildActionExecuter.java:42)
error	23-Sep-2022 07:46:24		at org.gradle.launcher.exec.BuildTreeScopeBuildActionExecuter.execute(BuildTreeScopeBuildActionExecuter.java:28)
error	23-Sep-2022 07:46:24		at org.gradle.tooling.internal.provider.ContinuousBuildActionExecuter.execute(ContinuousBuildActionExecuter.java:87)
error	23-Sep-2022 07:46:24		at org.gradle.tooling.internal.provider.ContinuousBuildActionExecuter.execute(ContinuousBuildActionExecuter.java:55)
error	23-Sep-2022 07:46:24		at org.gradle.tooling.internal.provider.SubscribableBuildActionExecuter.execute(SubscribableBuildActionExecuter.java:60)
error	23-Sep-2022 07:46:24		at org.gradle.tooling.internal.provider.SubscribableBuildActionExecuter.execute(SubscribableBuildActionExecuter.java:38)
error	23-Sep-2022 07:46:24		at org.gradle.tooling.internal.provider.SessionScopeBuildActionExecuter.execute(SessionScopeBuildActionExecuter.java:68)
error	23-Sep-2022 07:46:24		at org.gradle.tooling.internal.provider.SessionScopeBuildActionExecuter.execute(SessionScopeBuildActionExecuter.java:38)
error	23-Sep-2022 07:46:24		at org.gradle.tooling.internal.provider.GradleThreadBuildActionExecuter.execute(GradleThreadBuildActionExecuter.java:37)
error	23-Sep-2022 07:46:24		at org.gradle.tooling.internal.provider.GradleThreadBuildActionExecuter.execute(GradleThreadBuildActionExecuter.java:26)
error	23-Sep-2022 07:46:24		at org.gradle.tooling.internal.provider.StartParamsValidatingActionExecuter.execute(StartParamsValidatingActionExecuter.java:60)
error	23-Sep-2022 07:46:24		at org.gradle.tooling.internal.provider.StartParamsValidatingActionExecuter.execute(StartParamsValidatingActionExecuter.java:32)
error	23-Sep-2022 07:46:24		at org.gradle.tooling.internal.provider.SessionFailureReportingActionExecuter.execute(SessionFailureReportingActionExecuter.java:56)
error	23-Sep-2022 07:46:24		at org.gradle.tooling.internal.provider.SessionFailureReportingActionExecuter.execute(SessionFailureReportingActionExecuter.java:42)
error	23-Sep-2022 07:46:24		at org.gradle.tooling.internal.provider.SetupLoggingActionExecuter.execute(SetupLoggingActionExecuter.java:48)
error	23-Sep-2022 07:46:24		at org.gradle.tooling.internal.provider.SetupLoggingActionExecuter.execute(SetupLoggingActionExecuter.java:32)
error	23-Sep-2022 07:46:24		at org.gradle.launcher.daemon.server.exec.ExecuteBuild.doBuild(ExecuteBuild.java:68)
error	23-Sep-2022 07:46:24		at org.gradle.launcher.daemon.server.exec.BuildCommandOnly.execute(BuildCommandOnly.java:37)
error	23-Sep-2022 07:46:24		at org.gradle.launcher.daemon.server.api.DaemonCommandExecution.proceed(DaemonCommandExecution.java:104)
error	23-Sep-2022 07:46:24		at org.gradle.launcher.daemon.server.exec.WatchForDisconnection.execute(WatchForDisconnection.java:39)
error	23-Sep-2022 07:46:24		at org.gradle.launcher.daemon.server.api.DaemonCommandExecution.proceed(DaemonCommandExecution.java:104)
error	23-Sep-2022 07:46:24		at org.gradle.launcher.daemon.server.exec.ResetDeprecationLogger.execute(ResetDeprecationLogger.java:29)
error	23-Sep-2022 07:46:24		at org.gradle.launcher.daemon.server.api.DaemonCommandExecution.proceed(DaemonCommandExecution.java:104)
error	23-Sep-2022 07:46:24		at org.gradle.launcher.daemon.server.exec.RequestStopIfSingleUsedDaemon.execute(RequestStopIfSingleUsedDaemon.java:35)
error	23-Sep-2022 07:46:24		at org.gradle.launcher.daemon.server.api.DaemonCommandExecution.proceed(DaemonCommandExecution.java:104)
error	23-Sep-2022 07:46:24		at org.gradle.launcher.daemon.server.exec.ForwardClientInput$2.create(ForwardClientInput.java:78)
error	23-Sep-2022 07:46:24		at org.gradle.launcher.daemon.server.exec.ForwardClientInput$2.create(ForwardClientInput.java:75)
error	23-Sep-2022 07:46:24		at org.gradle.util.Swapper.swap(Swapper.java:38)
error	23-Sep-2022 07:46:24		at org.gradle.launcher.daemon.server.exec.ForwardClientInput.execute(ForwardClientInput.java:75)
error	23-Sep-2022 07:46:24		at org.gradle.launcher.daemon.server.api.DaemonCommandExecution.proceed(DaemonCommandExecution.java:104)
error	23-Sep-2022 07:46:24		at org.gradle.launcher.daemon.server.exec.LogAndCheckHealth.execute(LogAndCheckHealth.java:55)
error	23-Sep-2022 07:46:24		at org.gradle.launcher.daemon.server.api.DaemonCommandExecution.proceed(DaemonCommandExecution.java:104)
error	23-Sep-2022 07:46:24		at org.gradle.launcher.daemon.server.exec.LogToClient.doBuild(LogToClient.java:63)
error	23-Sep-2022 07:46:24		at org.gradle.launcher.daemon.server.exec.BuildCommandOnly.execute(BuildCommandOnly.java:37)
error	23-Sep-2022 07:46:24		at org.gradle.launcher.daemon.server.api.DaemonCommandExecution.proceed(DaemonCommandExecution.java:104)
error	23-Sep-2022 07:46:24		at org.gradle.launcher.daemon.server.exec.EstablishBuildEnvironment.doBuild(EstablishBuildEnvironment.java:82)
error	23-Sep-2022 07:46:24		at org.gradle.launcher.daemon.server.exec.BuildCommandOnly.execute(BuildCommandOnly.java:37)
error	23-Sep-2022 07:46:24		at org.gradle.launcher.daemon.server.api.DaemonCommandExecution.proceed(DaemonCommandExecution.java:104)
error	23-Sep-2022 07:46:24		at org.gradle.launcher.daemon.server.exec.StartBuildOrRespondWithBusy$1.run(StartBuildOrRespondWithBusy.java:52)
error	23-Sep-2022 07:46:24		at org.gradle.launcher.daemon.server.DaemonStateCoordinator$1.run(DaemonStateCoordinator.java:297)
error	23-Sep-2022 07:46:24		at org.gradle.internal.concurrent.ExecutorPolicy$CatchAndRecordFailures.onExecute(ExecutorPolicy.java:64)
error	23-Sep-2022 07:46:24		at org.gradle.internal.concurrent.ManagedExecutorImpl$1.run(ManagedExecutorImpl.java:48)
error	23-Sep-2022 07:46:24		at org.gradle.internal.concurrent.ThreadFactoryImpl$ManagedThreadRunnable.run(ThreadFactoryImpl.java:56)

Thanks

If it’s specifically failing to upload the report (POST api/ce/submit) it might be that the reverse proxy sitting in front of your SonarQube server (that serves it over HTTPS) doesn’t accept the request (the payload is too large, etc.)

I would recommend checking the logs of the reverse proxy.

Thanks, I will check it.

I have just run the same build from my laptop instead of bamboo and it was able to do the POST

[23/Sep/2022:08:48:10 +0200] "GET /sonarqube/batch/project.protobuf?...."
[23/Sep/2022:08:49:15 +0200] "POST /sonarqube/api/ce/submit?..."