# Error during SonarQube Scanner execution in Jenkins

**URL:** <https://community.sonarsource.com/t/error-during-sonarqube-scanner-execution-in-jenkins/17532>\
**Category:** SonarQube Server / Community Build\
**Created:** [December 9, 2019, 12:43pm UTC](https://community.sonarsource.com/t/error-during-sonarqube-scanner-execution-in-jenkins/17532 "2019-12-09T12:43:35Z")\
**Posts on this page:** 6\
**Page:** 1

<div class="post-metadata">

**Author:** ![Narayan\_Prasad](https://dub1.discourse-cdn.com/sonarsource/user_avatar/community.sonarsource.com/narayan_prasad/32/7696_2.png) [@Narayan\_Prasad](https://community.sonarsource.com/u/Narayan_Prasad)\
**Post date:** [December 9, 2019, 12:43pm UTC](https://community.sonarsource.com/t/error-during-sonarqube-scanner-execution-in-jenkins/17532/1 "2019-12-09T12:43:35Z")

</div>

Hi Team,

I’m not able to build Ant project with Sonarqube.  
In jenkins it is able to build the project, after that getting error : Error during SonarQube Scanner execution

warfile:  
[mkdir] Created dir: /var/lib/jenkins/workspace/wsd\_issuetracker\_build-SonarQube-POC/dist  
[war] Building war: /var/lib/jenkins/workspace/wsd\_issuetracker\_build-SonarQube-POC/dist/issuetracker.war  
all:

BUILD SUCCESSFUL  
Total time: 49 seconds  
[wsd\_issuetracker\_build-SonarQube-POC] $ /opt/sonar-scanner/bin/sonar-scanner -Dsonar.host.url=http://13.229.69.184:9000/ \*\*\*\*\*\*\*\* -Dsonar.projectName=WSD\_Issuetracker\_Build\_SonarQube -Dsonar.projectVersion=1.0 -Dsonar.projectKey=WSD\_Issuetracker\_Build\_SonarQube -Dsonar.sources=/var/lib/jenkins/workspace/wsd\_issuetracker\_build-SonarQube-POC/src -Dsonar.projectBaseDir=/var/lib/jenkins/workspace/wsd\_issuetracker\_build-SonarQube-POC

.  
.  
.  
.  
.  
.  
INFO: Load metrics repository  
INFO: Load metrics repository (done) | time=28ms  
WARNING: An illegal reflective access operation has occurred  
WARNING: Illegal reflective access by net.sf.cglib.core.ReflectUtils$1 (file:/var/lib/jenkins/.sonar/cache/866bb1adbf016ea515620f1aaa15ec53/sonar-javascript-plugin.jar) to method java.lang.ClassLoader.defineClass(java.lang.String,byte,int,int,java.security.ProtectionDomain)  
WARNING: Please consider reporting this to the maintainers of net.sf.cglib.core.ReflectUtils$1  
WARNING: Use --illegal-access=warn to enable warnings of further illegal reflective access operations  
WARNING: All illegal access operations will be denied in a future release  
INFO: Sensor JavaSquidSensor [java]  
INFO: Configured Java source version (sonar.java.source): none  
INFO: JavaClasspath initialization  
INFO: ------------------------------------------------------------------------  
INFO: EXECUTION FAILURE  
INFO: ------------------------------------------------------------------------  
INFO: Total time: 11.236s  
INFO: Final Memory: 12M/44M  
INFO: ------------------------------------------------------------------------  
ERROR: Error during SonarQube Scanner execution  
org.sonar.java.AnalysisException: Please provide compiled classes of your project with sonar.java.binaries property  
at org.sonar.java.JavaClasspath.init(JavaClasspath.java:64)  
at org.sonar.java.AbstractJavaClasspath.getElements(AbstractJavaClasspath.java:280)  
at org.sonar.java.SonarComponents.getJavaClasspath(SonarComponents.java:209)  
at org.sonar.java.JavaSquid.(JavaSquid.java:84)  
at org.sonar.plugins.java.JavaSquidSensor.execute(JavaSquidSensor.java:87)  
at org.sonar.scanner.sensor.AbstractSensorWrapper.analyse(AbstractSensorWrapper.java:48)  
at org.sonar.scanner.sensor.ModuleSensorsExecutor.execute(ModuleSensorsExecutor.java:85)  
at org.sonar.scanner.sensor.ModuleSensorsExecutor.lambda$execute$1(ModuleSensorsExecutor.java:59)  
at org.sonar.scanner.sensor.ModuleSensorsExecutor.withModuleStrategy(ModuleSensorsExecutor.java:77)  
at org.sonar.scanner.sensor.ModuleSensorsExecutor.execute(ModuleSensorsExecutor.java:59)  
at org.sonar.scanner.scan.ModuleScanContainer.doAfterStart(ModuleScanContainer.java:82)  
at org.sonar.core.platform.ComponentContainer.startComponents(ComponentContainer.java:136)  
at org.sonar.core.platform.ComponentContainer.execute(ComponentContainer.java:122)  
at org.sonar.scanner.scan.ProjectScanContainer.scan(ProjectScanContainer.java:387)  
at org.sonar.scanner.scan.ProjectScanContainer.scanRecursively(ProjectScanContainer.java:383)  
at org.sonar.scanner.scan.ProjectScanContainer.doAfterStart(ProjectScanContainer.java:346)  
at org.sonar.core.platform.ComponentContainer.startComponents(ComponentContainer.java:136)  
at org.sonar.core.platform.ComponentContainer.execute(ComponentContainer.java:122)  
at org.sonar.scanner.bootstrap.GlobalContainer.doAfterStart(GlobalContainer.java:141)  
at org.sonar.core.platform.ComponentContainer.startComponents(ComponentContainer.java:136)  
at org.sonar.core.platform.ComponentContainer.execute(ComponentContainer.java:122)  
at org.sonar.batch.bootstrapper.Batch.doExecute(Batch.java:72)  
at org.sonar.batch.bootstrapper.Batch.execute(Batch.java:66)  
at org.sonarsource.scanner.api.internal.batch.BatchIsolatedLauncher.execute(BatchIsolatedLauncher.java:46)  
at java.base/jdk.internal.reflect.NativeMethodAccessorImpl.invoke0(Native Method)  
at java.base/jdk.internal.reflect.NativeMethodAccessorImpl.invoke(Unknown Source)  
at java.base/jdk.internal.reflect.DelegatingMethodAccessorImpl.invoke(Unknown Source)  
at java.base/java.lang.reflect.Method.invoke(Unknown Source)  
at org.sonarsource.scanner.api.internal.IsolatedLauncherProxy.invoke(IsolatedLauncherProxy.java:60)  
at com.sun.proxy.$Proxy0.execute(Unknown Source)  
at org.sonarsource.scanner.api.EmbeddedScanner.doExecute(EmbeddedScanner.java:189)  
at org.sonarsource.scanner.api.EmbeddedScanner.execute(EmbeddedScanner.java:138)  
at org.sonarsource.scanner.cli.Main.execute(Main.java:112)  
at org.sonarsource.scanner.cli.Main.execute(Main.java:75)  
at org.sonarsource.scanner.cli.Main.main(Main.java:61)  
ERROR:  
ERROR: Re-run SonarQube Scanner using the -X switch to enable full debug logging.  
WARN: Unable to locate ‘report-task.txt’ in the workspace. Did the SonarScanner succeeded?  
ERROR: SonarQube scanner exited with non-zero code: 1  
Publish artifacts to S3 Bucket Build is still running  
Publish artifacts to S3 Bucket Using S3 profile: Jenkins  
Publish artifacts to S3 Bucket Skipping publishing on S3 because build failed  
Finished: FAILURE

In build.xml I have added the path of libaries file

```
<!-- Execute SonarScanner for Ant Analysis -->
<sonar:sonar />

```

but still getting the error for it, please help in solving this issue.

I’m using latest version of SonarQube version 8.0 and sonar-java-plugin-5.14.0.18788.jar ,sonarqube-ant-task-2.7.0.1612.jar, Jenkins version is [Jenkins ver. 2.202] , sonar-scanner-cli-4.2.0.1873-linux

---

<div class="post-metadata">

**Author:** ![Narayan\_Prasad](https://dub1.discourse-cdn.com/sonarsource/user_avatar/community.sonarsource.com/narayan_prasad/32/7696_2.png) [@Narayan\_Prasad](https://community.sonarsource.com/u/Narayan_Prasad)\
**Post date:** [December 9, 2019, 12:46pm UTC](https://community.sonarsource.com/t/error-during-sonarqube-scanner-execution-in-jenkins/17532/2 "2019-12-09T12:46:49Z")

</div>

Added this in class path ![class|690x138](upload://3Vd3vFuMDcbWBdXY0xFYhoygyyT.jpeg)

---

<div class="post-metadata">

**Author:** ![Alexandre\_Frigout](https://dub1.discourse-cdn.com/sonarsource/user_avatar/community.sonarsource.com/alexandre_frigout/32/151_2.png) [@Alexandre\_Frigout](https://community.sonarsource.com/u/Alexandre_Frigout)\
**Post date:** [December 9, 2019, 1:26pm UTC](https://community.sonarsource.com/t/error-during-sonarqube-scanner-execution-in-jenkins/17532/3 "2019-12-09T13:26:07Z")

</div>

Hello,  
Have you checked the scanner for ant [documentation](https://docs.sonarqube.org/latest/analysis/scan/sonarscanner-for-ant/) ?  
it seems that your build.xml misses the below line:  
`<property name="sonar.java.binaries" value="build" />`  
Alex.

---

<div class="post-metadata">

**Author:** ![Narayan\_Prasad](https://dub1.discourse-cdn.com/sonarsource/user_avatar/community.sonarsource.com/narayan_prasad/32/7696_2.png) [@Narayan\_Prasad](https://community.sonarsource.com/u/Narayan_Prasad)\
**Post date:** [December 9, 2019, 1:53pm UTC](https://community.sonarsource.com/t/error-during-sonarqube-scanner-execution-in-jenkins/17532/4 "2019-12-09T13:53:23Z")

</div>

It is added @Alexandre_Frigout  
Please check

 ![Sonar1](https://europe1.discourse-cdn.com/sonarsource/uploads/sonarcommunity/original/2X/a/ab389f1fe5b5164d77e8a7da52ace32486f7aa11.jpeg) ![sonar2](https://europe1.discourse-cdn.com/sonarsource/uploads/sonarcommunity/original/2X/8/8373836b2bdcc0b252d9f7135e546ce0089989e2.jpeg)

---

<div class="post-metadata">

**Author:** ![Alexandre\_Frigout](https://dub1.discourse-cdn.com/sonarsource/user_avatar/community.sonarsource.com/alexandre_frigout/32/151_2.png) [@Alexandre\_Frigout](https://community.sonarsource.com/u/Alexandre_Frigout)\
**Post date:** [December 9, 2019, 2:30pm UTC](https://community.sonarsource.com/t/error-during-sonarqube-scanner-execution-in-jenkins/17532/5 "2019-12-09T14:30:07Z")

</div>

Are there any files in the `build` directory ?  
If not, you can find an example of a working build.xml file [here](https://github.com/SonarSource/sonar-scanning-examples/blob/master/sonarqube-scanner-ant/build.xml).  
Alex.

---

<div class="post-metadata">

**Author:** ![Narayan\_Prasad](https://dub1.discourse-cdn.com/sonarsource/user_avatar/community.sonarsource.com/narayan_prasad/32/7696_2.png) [@Narayan\_Prasad](https://community.sonarsource.com/u/Narayan_Prasad)\
**Post date:** [December 10, 2019, 6:03am UTC](https://community.sonarsource.com/t/error-during-sonarqube-scanner-execution-in-jenkins/17532/6 "2019-12-10T06:03:25Z")

</div>

Yeah, the above screenshot is from build.xml file, I’ll try once copying the given xml file and let me check if works or not.
