Report a bug   Fault


Topic Replies Activity
About the Fault category 1 April 20, 2018
org.sonar.plugins.php.AnalysisException: Unable to read file ( symbolic link ) 1 August 23, 2019
Execution Failure: Tasks support was removed 6 August 22, 2019
java.lang.IndexOutOfBoundsException: Index: 0, Size: 0 9 August 22, 2019
Unable to anaylze T-SQL file, ClassCastException 1 August 21, 2019
Latest update (4.7.2) to ADO Sonarqube extension caused Run Code Analysis to hang 2 August 19, 2019
SQL files are ignored when using the Sonar Scanner for MSBuild 3 August 16, 2019
SonarQube - (Tfs2018 Update2 [16.131.27701.1]) - Run Code Analysis fails 4.7.0 - 4.7.2 2 August 16, 2019
Run Code Analysis task failing 1 August 15, 2019
SonarCloud Extension 1.8.1 Regression for Standalone Scanner 1 August 14, 2019
VSTS Publish Quality Gate Result with NPM, parses node_modules folder and hangs on symbolic links 5 August 13, 2019
Sonar Java plugin 5.14.0.18788 crashes SonarQube 3 August 12, 2019
SonarQube 7.9LTS Fails to Start When Built from Source 11 August 6, 2019
Issues on resource folders using Sonar Gradle Plugin 2.6.2 and newer 3 July 31, 2019
No results for Git Submodules 12 July 30, 2019
SonarScanner dependencies unpack incorrectly Linux 3 July 26, 2019
C++ Wrapper fails without error message in bitbake 9 July 23, 2019
SonarJava 5.13.1.18282 silently ignores JaCoCo XML report 8 July 18, 2019
VSTS Prepare Analysis ignores .proxybypass list 4 July 17, 2019
SonarQube - C++ - Ubuntu - build-wrapper LD_PRELOAD Error 13 July 17, 2019
SonarQube Service Stopped Working 2 July 12, 2019
SonarQube 7.9 Upgrade Issue 2 July 11, 2019
SonarQube issue assignee change is not functional after upgrade to SonarQube 7.9 LTS 2 July 10, 2019
NoSuchMethodError in SonarLint when starting a new analysis in IntelliJ IDEA 3 July 9, 2019
SonarQube 7.8 Enterprise Edition, uninstalling SonarPHP causes failure on restart 7 July 9, 2019
BUG in Quality Gates in 7.9 LTS on Microsoft SQL 8 July 9, 2019
Parse error with T-SQL plugin in sonar scanner for SQL files 9 July 8, 2019
S2631, s2083, s3649, s2091 "EXECUTION FAILURE" 10 July 3, 2019
SonarPHP doesn't analyze php-unit tests with dataProvider 9 July 1, 2019
Issue when trying to configure binding with remote server after a previous unresponsive configuration 1 June 5, 2019